1-Octadecene
- Formula: C18H36
- Molecular weight: 252.4784
- IUPAC Standard InChIKey: CCCMONHAUSKTEQ-UHFFFAOYSA-N
- CAS Registry Number: 112-88-9
- Chemical structure:
View 3d structure (requires JavaScript / HTML 5) - Species with the same structure:
- Other names: α-Octadecene; Octadecylene, α-; Neodene 18; Octadec-1-ene; Octadecene-1; Octadeca-1-ene

Phase change data

Data compiled as indicated in comments:
BS - Robert L. Brown and Stephen E. Stein
TRC - Thermodynamics Research Center, NIST Boulder Laboratories, Chris Muzny director
AC - William E. Acree, Jr., James S. Chickos
Quantity | Value | Units | Method | Reference | Comment |
---|---|---|---|---|---|
Tfus | 291. | K | N/A | Geldof and Wibaut, 1948 | Uncertainty assigned by TRC = 3. K; TRC |
Quantity | Value | Units | Method | Reference | Comment |
ΔvapH° | 90. | kJ/mol | N/A | Reid, 1972 | AC |
Reduced pressure boiling point
Tboil (K) | Pressure (bar) | Reference | Comment |
---|---|---|---|
452. | 0.020 | Farchan Laboratories, 1990 | BS |
452.2 | 0.020 | Weast and Grasselli, 1989 | BS |
Enthalpy of vaporization
ΔvapH (kJ/mol) | Temperature (K) | Method | Reference | Comment |
---|---|---|---|---|
76.4 | 414. | A | Stephenson and Malanowski, 1987 | Based on data from 399. to 589. K.; AC |

Reaction thermochemistry data

Data compiled by: Hussein Y. Afeefy, Joel F. Liebman, and Stephen E. Stein
Individual Reactions
By formula: C18H36 + H2 = C18H38
Quantity | Value | Units | Method | Reference | Comment |
---|---|---|---|---|---|
ΔrH° | -125.9 ± 1.7 | kJ/mol | Chyd | Rogers and Skanupong, 1974 | liquid phase; solvent: Hexane |

Van Den Dool and Kratz RI, non-polar column, custom temperature program

Data compiled by: NIST Mass Spectrometry Data Center, William E. Wallace, director

Column type Capillary
Active phase DB-5
Column length (m) 30.
Carrier gas He
Substrate
Column diameter (mm) 0.25
Phase thickness (μm)
Program 30C => 5K/min=120C => 10C/min => 270C
I 1793.
ReferenceZaikin and Borisov, 2002
Comment MSDC-RI

Kovats' RI, non-polar column, isothermal

Data compiled by: NIST Mass Spectrometry Data Center, William E. Wallace, director

Column type CapillaryCapillaryCapillaryCapillaryCapillary
Active phase DB-1CP Sil 5 CBDB-1ApolaneApiezon L
Column length (m) 10.30.30.250.250.
Carrier gas He  N2 or H2N2 or H2
Substrate
Column diameter (mm) 0.250.250.250.250.25
Phase thickness (μm) 0.250.250.25
Temperature (C) 140.240.240.160.154.
I 1793.1799.1791.1786.81787.8
ReferenceBeens, Tijssen, et al., 1998Hanai and Hong, 1989Hanai and Hong, 1989Soják, Krupcík, et al., 1980Soják, Krupcík, et al., 1980
Comment MSDC-RI MSDC-RI MSDC-RI MSDC-RI MSDC-RI

References

Geldof and Wibaut, 1948
Geldof, H.; Wibaut, J.P.,
Recl. Trav. Chim. Pays-Bas, 1948, 67, 105. [all data]
Reid, 1972
Reid, Robert C.,
Handbook on vapor pressure and heats of vaporization of hydrocarbons and related compounds, R. C. Wilhort and B. J. Zwolinski, Texas A Research Foundation. College Station, Texas(1971). 329 pages.$10.00,
AIChE J., 1972, 18, 6, 1278-1278, https://doi.org/10.1002/aic.690180637
. [all data]
Farchan Laboratories, 1990
Farchan Laboratories,
Research Chemicals Catalog, Farchan Laboratories, Gainesville, FL, 1990, 91. [all data]
Weast and Grasselli, 1989
CRC Handbook of Data on Organic Compounds, 2nd Editon, Weast,R.C and Grasselli, J.G., ed(s)., CRC Press, Inc., Boca Raton, FL, 1989, 1. [all data]
Stephenson and Malanowski, 1987
Stephenson, Richard M.; Malanowski, Stanislaw,
Handbook of the Thermodynamics of Organic Compounds, 1987, https://doi.org/10.1007/978-94-009-3173-2
. [all data]
Rogers and Skanupong, 1974
Rogers, D.W.; Skanupong, S.,
Heats of hydrogenation of sixteen terminal monoolefins. The alternating effect,
J. Phys. Chem., 1974, 78, 2569-2572. [all data]