Hexadecane, 1-bromo-
- Formula: C16H33Br
- Molecular weight: 305.337
- IUPAC Standard InChIKey: HNTGIJLWHDPAFN-UHFFFAOYSA-N
- CAS Registry Number: 112-82-3
- Chemical structure:
View 3d structure (requires JavaScript / HTML 5) - Other names: n-Hexadecyl bromide; n-Hexadecyl-1-bromide; Cetyl bromide; Hexadecyl bromide; 1-Bromohexadecane; 1-Hexadecyl bromide

Gas phase thermochemistry data

Data compiled by: Hussein Y. Afeefy, Joel F. Liebman, and Stephen E. Stein
Quantity | Value | Units | Method | Reference | Comment |
---|---|---|---|---|---|
ΔfH°gas | -350.1 ± 3.2 | kJ/mol | Ccr | Stridh, 1976 |

Condensed phase thermochemistry data

Data compiled by: Hussein Y. Afeefy, Joel F. Liebman, and Stephen E. Stein
Quantity | Value | Units | Method | Reference | Comment |
---|---|---|---|---|---|
ΔfH°liquid | -444.5 ± 2.8 | kJ/mol | Ccr | Stridh, 1976 | |
Quantity | Value | Units | Method | Reference | Comment |
ΔcH°liquid | -10567.8 ± 1.7 | kJ/mol | Ccr | Stridh, 1976 |

Phase change data

Data compiled as indicated in comments:
BS - Robert L. Brown and Stephen E. Stein
TRC - Thermodynamics Research Center, NIST Boulder Laboratories, Chris Muzny director
AC - William E. Acree, Jr., James S. Chickos
ALS - Hussein Y. Afeefy, Joel F. Liebman, and Stephen E. Stein
Quantity | Value | Units | Method | Reference | Comment |
---|---|---|---|---|---|
Tboil | 609.2 | K | N/A | Weast and Grasselli, 1989 | BS |
Quantity | Value | Units | Method | Reference | Comment |
Tfus | 288.15 | K | N/A | Hesse, 1967 | Uncertainty assigned by TRC = 1.5 K; TRC |
Quantity | Value | Units | Method | Reference | Comment |
ΔvapH° | 22.6 | kcal/mol | N/A | Majer and Svoboda, 1985 | |
ΔvapH° | 22.6 ± 0.36 | kcal/mol | C | Weber and Defibaugh, 1996 | AC |
ΔvapH° | 22.6 ± 0.36 | kcal/mol | C | Mansson, Sellers, et al., 1977 | ALS |
ΔvapH° | 22.57 ± 0.36 | kcal/mol | V | Stridh, 1976 | ALS |
Reduced pressure boiling point
Tboil (K) | Pressure (atm) | Reference | Comment |
---|---|---|---|
463.2 | 0.014 | Aldrich Chemical Company Inc., 1990 | BS |
463. | 0.014 | Farchan Laboratories, 1990 | BS |
Enthalpy of vaporization
ΔvapH (kcal/mol) | Temperature (K) | Method | Reference | Comment |
---|---|---|---|---|
17.2 | 476. | A,E | Stephenson and Malanowski, 1987 | Based on data from 461. to 673. K. See also Li and Rossini, 1961 and Dykyj and Vanko, 1970.; AC |

Van Den Dool and Kratz RI, non-polar column, custom temperature program

Column type | Active phase | I | Reference | Comment |
---|---|---|---|---|
Capillary | DB-1 | 1965. | Peng, 2000 | 15. m/0.53 mm/1. μm, He; Program: 40C(3min) => 8C/min => 200(1min) => 5C/min => 300C(25min) |

Van Den Dool and Kratz RI, polar column, temperature ramp

Column type | Active phase | I | Reference | Comment |
---|---|---|---|---|
Capillary | DB-Wax | 2258. | Peng, 2000 | 15. m/0.53 mm/1. μm, He, 40. C @ 3. min, 5. K/min, 220. C @ 30. min |
Capillary | HP-Wax | 2220. | Peng, 2000 | 15. m/0.53 mm/1. μm, He, 40. C @ 3. min, 5. K/min, 220. C @ 30. min |

Normal alkane RI, non-polar column, isothermal

Column type | Active phase | Temperature (C) | I | Reference | Comment |
---|---|---|---|---|---|
Capillary | Apiezon L | 130. | 1957. | Arruda, Junkes, et al., 2008 |

Normal alkane RI, polar column, custom temperature program

Column type | Active phase | I | Reference | Comment |
---|---|---|---|---|
Capillary | DB-Wax | 2237. | Peng, Yang, et al., 1991 | Program: not specified |

References

Stridh, 1976
Stridh, G.,
Enthalpies of formation of 1-bromododecane and 1-bromohexadecane and the CH2-increment in the 1-bromoalkane series,
J. Chem. Thermodyn., 1976, 8, 901-906. [all data]