Butane, 1,1'-[oxybis(2,1-ethanediyloxy)]bis-
- Formula: C12H26O3
- Molecular weight: 218.3330
- IUPAC Standard InChIKey: KZVBBTZJMSWGTK-UHFFFAOYSA-N
- CAS Registry Number: 112-73-2
- Chemical structure:
View 3d structure (requires JavaScript / HTML 5) - Other names: Ether, bis(2-butoxyethyl); Bis(2-butoxyethyl) ether; Dibutyl carbitol; Diethylene glycol dibutyl ether; 2-(2-Butoxyethoxy)-1-butoxyethane; 2-Butoxyethyl ether; 2,2'-Dibutoxyethyl ether; 5,8,11-Trioxapentadecane; Diethylene glycol di-n-butyl ether; Butyl diglyme; Dibutylether diethylenglykolu; Ether, bis(butoxyethyl); Butex

Phase change data

Data compiled as indicated in comments:
BS - Robert L. Brown and Stephen E. Stein
TRC - Thermodynamics Research Center, NIST Boulder Laboratories, Chris Muzny director
AC - William E. Acree, Jr., James S. Chickos
Quantity | Value | Units | Method | Reference | Comment |
---|---|---|---|---|---|
Tboil | 529.2 | K | N/A | Weast and Grasselli, 1989 | BS |
Tboil | 529.15 | K | N/A | Anonymous, 1982 | TRC |
Quantity | Value | Units | Method | Reference | Comment |
Tfus | 212.95 | K | N/A | Anonymous, 1982 | TRC |
Quantity | Value | Units | Method | Reference | Comment |
ΔvapH° | 73.8 ± 1.7 | kJ/mol | GC | Nichols, Orf, et al., 2000 | AC |
Enthalpy of vaporization
ΔvapH (kJ/mol) | Temperature (K) | Method | Reference | Comment |
---|---|---|---|---|
56.6 | 308. | A | Stephenson and Malanowski, 1987 | Based on data from 293. to 528. K.; AC |

Normal alkane RI, polar column, custom temperature program

Column type | Active phase | I | Reference | Comment |
---|---|---|---|---|
Capillary | DB-Wax | 1727. | Peng, Yang, et al., 1991 | Program: not specified |

References

Weast and Grasselli, 1989
CRC Handbook of Data on Organic Compounds, 2nd Editon, Weast,R.C and Grasselli, J.G., ed(s)., CRC Press, Inc., Boca Raton, FL, 1989, 1. [all data]
Anonymous, 1982
Anonymous, X.,
Glymes Grant Chemical, 1982, Baton Rouge, LA 1982. [all data]
Nichols, Orf, et al., 2000
Nichols, Gary; Orf, Jennifer; Reiter, Sarah M.; Chickos, James; Gokel, George W.,
The vaporization enthalpies of some crown and polyethers by correlation gas chromatography,
Thermochimica Acta, 2000, 346, 1-2, 15-28, https://doi.org/10.1016/S0040-6031(99)00405-0
. [all data]
Stephenson and Malanowski, 1987
Stephenson, Richard M.; Malanowski, Stanislaw,
Handbook of the Thermodynamics of Organic Compounds, 1987, https://doi.org/10.1007/978-94-009-3173-2
. [all data]
Peng, Yang, et al., 1991
Peng, C.T.; Yang, Z.C.; Ding, S.F.,
Prediction of rentention idexes. II. Structure-retention index relationship on polar columns,
J. Chromatogr., 1991, 586, 1, 85-112, https://doi.org/10.1016/0021-9673(91)80028-F
. [all data]