Benzene, (2-methylpropoxy)-
- Formula: C10H14O
- Molecular weight: 150.2176
- IUPAC Standard InChIKey: ONNUYWHIJSKABC-UHFFFAOYSA-N
- CAS Registry Number: 1126-75-6
- Chemical structure:
View 3d structure (requires JavaScript / HTML 5) - Other names: Ether, isobutyl phenyl; Isobutyl phenyl ether

Phase change data

Data compiled by: Thermodynamics Research Center, NIST Boulder Laboratories, Chris Muzny director
Quantity | Value | Units | Method | Reference | Comment |
---|---|---|---|---|---|
Tboil | 469.15 | K | N/A | Smith, 1933 | Uncertainty assigned by TRC = 3. K |
Tboil | 473.05 | K | N/A | Perkin, 1896 | Uncertainty assigned by TRC = 0.5 K |

References

Smith, 1933
Smith, R.A.,
Studies in the Rearrangements of Phenyl Ethers. The Action of Aluminum Chloride on Butyl Phenyl Ethers,
J. Am. Chem. Soc., 1933, 55, 3718. [all data]
Perkin, 1896
Perkin, W.H.,
LXIX. On Magnetic Rotatory Power, especially of Aromatic Compounds,
J. Chem. Soc., 1896, 69, 1025-1257. [all data]