Lauryl acetate
- Formula: C14H28O2
- Molecular weight: 228.3709
- IUPAC Standard InChIKey: VZWGRQBCURJOMT-UHFFFAOYSA-N
- CAS Registry Number: 112-66-3
- Chemical structure:
View 3d structure (requires JavaScript / HTML 5) - Other names: Dodecan-1-yl acetate; Dodecyl alcohol, acetate; 1-Dodecanol acetate; n-Dodecyl ethanoate; Dodecanol acetate; Dodecanyl acetate; n-Dodecyl acetate; Acetic acid, dodecyl ester; Dodecyl acetate; NSC 67366; 70808-58-1; Dodecan-1-ol, acetate

Phase change data

Data compiled as indicated in comments:
BS - Robert L. Brown and Stephen E. Stein
AC - William E. Acree, Jr., James S. Chickos
Quantity | Value | Units | Method | Reference | Comment |
---|---|---|---|---|---|
Tboil | 538.2 | K | N/A | Weast and Grasselli, 1989 | BS |
Quantity | Value | Units | Method | Reference | Comment |
ΔvapH° | 79.6 ± 0.3 | kJ/mol | GS | Krasnykh, Verevkin, et al., 2006 | Based on data from 289. to 333. K.; AC |
ΔvapH° | 81.8 | kJ/mol | GC | Koutek, Hoskovec, et al., 1997 | Based on data from 333. to 378. K. See also Ova, Koultek, et al., 2000.; AC |
Reduced pressure boiling point
Tboil (K) | Pressure (bar) | Reference | Comment |
---|---|---|---|
423.2 | 0.020 | Aldrich Chemical Company Inc., 1990 | BS |
Enthalpy of vaporization
ΔvapH (kJ/mol) | Temperature (K) | Method | Reference | Comment |
---|---|---|---|---|
70.5 | 413. | A | Stephenson and Malanowski, 1987 | Based on data from 398. to 540. K.; AC |

Kovats' RI, polar column, isothermal

Data compiled by: NIST Mass Spectrometry Data Center, William E. Wallace, director

Column type CapillaryCapillaryCapillaryCapillaryPacked
Active phase OV-351OV-351OV-351OV-351Carbowax 20M
Column length (m) 25.25.25.25.2.
Carrier gas N2N2N2N2
Substrate     Chromosorb W
Column diameter (mm) 0.320.320.320.32
Phase thickness (μm)
Temperature (C) 160.180.200.220.180.
I 1876.1896.1898.1900.1868.
ReferenceHaken and Korhonen, 1986Haken and Korhonen, 1986Haken and Korhonen, 1986Haken and Korhonen, 1986Zarazir, Chovin, et al., 1970
Comment MSDC-RI MSDC-RI MSDC-RI MSDC-RI MSDC-RI

References

Weast and Grasselli, 1989
CRC Handbook of Data on Organic Compounds, 2nd Editon, Weast,R.C and Grasselli, J.G., ed(s)., CRC Press, Inc., Boca Raton, FL, 1989, 1. [all data]
Krasnykh, Verevkin, et al., 2006
Krasnykh, Eugen L.; Verevkin, Sergey P.; Koutek, Bohumir; Doubsky, Jan,
Vapour pressures and enthalpies of vaporization of a series of the linear n-alkyl acetates,
The Journal of Chemical Thermodynamics, 2006, 38, 6, 717-723, https://doi.org/10.1016/j.jct.2005.08.003
. [all data]
Koutek, Hoskovec, et al., 1997
Koutek, Bohumír; Hoskovec, Michal; Vrkocová, Pavlína; Feltl, Ladislav,
Gas chromatographic determination of vapour pressures of pheromone-like compounds IV. Acetates, a reinvestigation,
Journal of Chromatography A, 1997, 759, 1-2, 93-109, https://doi.org/10.1016/S0021-9673(96)00775-3
. [all data]
Ova, Koultek, et al., 2000
Ova, P.V.; Koultek, B.; Hoskovec, M.,
Practice Oriented Results on Use and Production of Neem Ingredients and Pheromones VI, H. Kleeberg and C.P.W. Zebitz, ed(s)., Druck and Graphic, Giessen, 2000, 211-218. [all data]
Aldrich Chemical Company Inc., 1990
Aldrich Chemical Company Inc.,
Catalog Handbook of Fine Chemicals, Aldrich Chemical Company, Inc., Milwaukee WI, 1990, 1. [all data]
Stephenson and Malanowski, 1987
Stephenson, Richard M.; Malanowski, Stanislaw,
Handbook of the Thermodynamics of Organic Compounds, 1987, https://doi.org/10.1007/978-94-009-3173-2
. [all data]