9,12-Octadecadienoic acid (Z,Z)-, methyl ester
- Formula: C19H34O2
- Molecular weight: 294.4721
- IUPAC Standard InChIKey: WTTJVINHCBCLGX-NQLNTKRDSA-N
- CAS Registry Number: 112-63-0
- Chemical structure:
- Other names: Linoleic acid, methyl ester; Methyl cis,cis-9,12-octadecadienoate; Methyl linoleate; Methyl 9-cis,12-cis-octadecadienoate; 9,12-Octadecadienoic acid, methyl ester, (Z,Z); cis-9,cis-12-Octadecadienoic acid, methyl ester; cis-Linoleic acid methyl ester; Methyl (Z,Z)-9,12-octadecadienoate; (Z,Z)-9,12-octadecadienoic acid methyl ester; (9Z,12Z)-Octadecadienoic acid methyl ester; 9,12-Octadecadienoic acid (9Z,12Z)-, methyl ester; Methyl linolate; methyl (Z,Z)-9,12-octadienoate; Natural methyl linoleate

Condensed phase thermochemistry data

Data compiled by: Hussein Y. Afeefy, Joel F. Liebman, and Stephen E. Stein
Quantity | Value | Units | Method | Reference | Comment |
---|---|---|---|---|---|
ΔfH°liquid | -144.57 | kcal/mol | Chyd | Rogers and Siddiqui, 1975 | |
Quantity | Value | Units | Method | Reference | Comment |
ΔcH°liquid | -2794.00 ± 0.37 | kcal/mol | Ccb | Freedman, Bagby, et al., 1989 | Corresponding ΔfHºliquid = -154.33 kcal/mol (simple calculation by NIST; no Washburn corrections) |

Phase change data

Data compiled as indicated in comments:
BS - Robert L. Brown and Stephen E. Stein
Reduced pressure boiling point
Tboil (K) | Pressure (atm) | Reference | Comment |
---|---|---|---|
465.2 | 0.005 | Aldrich Chemical Company Inc., 1990 | BS |
Antoine Equation Parameters
log10(P) = A − (B / (T + C))
P = vapor pressure (atm)
T = temperature (K)
View plot Requires a JavaScript / HTML 5 canvas capable browser.
Temperature (K) | A | B | C | Reference | Comment |
---|---|---|---|---|---|
439.7 to 479. | 3.82275 | 2066.995 | -116.87 | Althouse and Triebold, 1944 | Coefficents calculated by NIST from author's data. |

Reaction thermochemistry data

Data compiled by: Hussein Y. Afeefy, Joel F. Liebman, and Stephen E. Stein
Individual Reactions
By formula: C19H34O2 + 2H2 = C19H38O2
Quantity | Value | Units | Method | Reference | Comment |
---|---|---|---|---|---|
ΔrH° | -58.60 ± 0.39 | kcal/mol | Chyd | Rogers and Siddiqui, 1975 | liquid phase; solvent: n-Hexane |

Kovats' RI, non-polar column, isothermal

Column type | Active phase | Temperature (C) | I | Reference | Comment |
---|---|---|---|---|---|
Capillary | OV-101 | 200. | 2066.9 | Kittiratanapiboon, Jeyashoke, et al., 1998 | 15. m/0.25 mm/0.2 μm, N2 |
Capillary | CP Sil 5 CB | 240. | 2078. | Hanai and Hong, 1989 | 30. m/0.25 mm/0.25 μm |
Capillary | DB-1 | 240. | 2092. | Hanai and Hong, 1989 | 30. m/0.25 mm/0.25 μm |
Packed | SE-30 | 200. | 2077. | Golovnya, Uralets, et al., 1976 | Gas Chrom Q (80-100 mesh); Column length: 1.5 m |

Kovats' RI, non-polar column, custom temperature program

Column type | Active phase | I | Reference | Comment |
---|---|---|---|---|
Packed | SE-30 | 2100. | Ramsey, Lee, et al., 1980 | He, Chromosorb G HP (80-100 mesh); Column length: 1.5 m; Program: not specified |

Kovats' RI, polar column, isothermal

Column type | Active phase | Temperature (C) | I | Reference | Comment |
---|---|---|---|---|---|
Capillary | CP-Wax | 240. | 2485. | Hanai and Hong, 1989 | 25. m/0.25 mm/0.22 μm |
Capillary | DB-Wax | 240. | 2523. | Hanai and Hong, 1989 | 25. m/0.25 mm/0.22 μm |

Kovats' RI, polar column, temperature ramp

Column type | Active phase | I | Reference | Comment |
---|---|---|---|---|
Capillary | Carbowax 20M | 2513. | Toda, Mihara, et al., 1983 | 2. K/min; Column length: 50. m; Column diameter: 0.23 mm; Tstart: 80. C; Tend: 200. C |

Kovats' RI, polar column, custom temperature program

Column type | Active phase | I | Reference | Comment |
---|---|---|---|---|
Capillary | DB-Wax | 2488. | Rezende and Fraga, 2003 | 30. m/0.25 mm/0.25 μm, He; Program: 40C(5min) => 5C/min => 150C => 8C/min => 240C(25min) |

Van Den Dool and Kratz RI, non-polar column, temperature ramp

Column type | Active phase | I | Reference | Comment |
---|---|---|---|---|
Capillary | HP-5MS | 2092. | Benkaci-Ali, Baaliouamer, et al., 2007 | 30. m/0.25 mm/0.25 μm, He, 60. C @ 8. min, 2. K/min, 250. C @ 30. min |
Capillary | DB-5 | 2096. | Rout, Rao, et al., 2007 | 25. m/0.25 mm/0.25 μm, He, 2. K/min, 200. C @ 60. min; Tstart: 60. C |
Capillary | DB-5 | 2076. | Wu, Zorn, et al., 2007 | 30. m/0.32 mm/0.25 μm, He, 40. C @ 2. min, 5. K/min, 250. C @ 5. min |
Capillary | DB-5 | 2079. | Wu, Zorn, et al., 2007 | 30. m/0.32 mm/0.25 μm, He, 40. C @ 2. min, 5. K/min, 250. C @ 5. min |
Capillary | HP-5MS | 2099.1 | Zeng, Zhao, et al., 2007 | 30. m/0.25 mm/0.25 μm, He, 4. K/min; Tstart: 80. C; Tend: 300. C |
Capillary | SPB-1 | 2071. | Blagojevic, Radulovic, et al., 2006 | 30. m/0.25 mm/0.25 μm, He, 50. C @ 3. min, 5. K/min, 250. C @ 15. min |
Capillary | DB-5 | 2097. | Blagojevic, Radulovic, et al., 2006 | 30. m/0.2 mm/0.25 μm, He, 50. C @ 3. min, 5. K/min, 250. C @ 15. min |
Capillary | HP-5MS | 2093. | Saroglou, Dorizas, et al., 2006 | 30. m/0.25 mm/0.25 μm, He, 60. C @ 5. min, 4. K/min; Tend: 280. C |
Capillary | HP-5MS | 2093. | Pino, Mesa, et al., 2005 | 30. m/0.25 mm/0.25 μm, He, 60. C @ 2. min, 4. K/min, 250. C @ 20. min |
Capillary | DB-5 | 2082. | Sati and Mathela, 2005 | 30. m/0.25 mm/0.26 μm, He, 3. K/min; Tstart: 60. C; Tend: 210. C |
Capillary | DB-5 | 2079. | Wu, Zorn, et al., 2005 | 30. m/0.32 mm/0.25 μm, He, 40. C @ 2. min, 5. K/min, 250. C @ 5. min |
Capillary | HP-5MS | 2092.1 | Zhao, Liang, et al., 2005 | 30. m/0.25 mm/0.25 μm, He, 2. K/min; Tstart: 80. C; Tend: 290. C |
Capillary | HP-5MS | 2094.5 | Zhao, Liang, et al., 2005 | 30. m/0.25 mm/0.25 μm, He, 4. K/min; Tstart: 80. C; Tend: 290. C |
Capillary | HP-5MS | 2095.6 | Zhao, Liang, et al., 2005 | 30. m/0.25 mm/0.25 μm, He, 6. K/min; Tstart: 80. C; Tend: 290. C |
Capillary | BP-1 | 2087. | Raina, Kumar, et al., 2004 | 30. m/0.32 mm/0.25 μm, N2, 5. K/min, 220. C @ 13. min; Tstart: 60. C |
Capillary | HP-1 | 2069. | Senatore, Rigano, et al., 2003 | 30. m/0.25 mm/0.33 μm, He, 40. C @ 5. min, 2. K/min, 260. C @ 20. min |
Capillary | BP-1 | 2070. | Tan, Wilkins, et al., 1989 | H2, 40. C @ 2. min, 4. K/min, 240. C @ 75. min; Column length: 12. m |
Capillary | OV-1 | 2061. | Tan, Holland, et al., 1988 | He, 8. K/min, 280. C @ 10. min; Column length: 25. m; Column diameter: 0.32 mm; Tstart: 40. C |

Van Den Dool and Kratz RI, non-polar column, custom temperature program

Column type | Active phase | I | Reference | Comment |
---|---|---|---|---|
Capillary | VF-5MS | 2103.7 | Tret'yakov, 2007 | 30. m/0.25 mm/0.25 μm, He; Program: Multi-step temperature program; T(initial)=60C; T(final)=270C |

Van Den Dool and Kratz RI, polar column, temperature ramp

Column type | Active phase | I | Reference | Comment |
---|---|---|---|---|
Capillary | ZB-Wax | 2476. | Wu, Zorn, et al., 2007 | 30. m/0.32 mm/0.25 μm, He, 40. C @ 2. min, 5. K/min, 250. C @ 5. min |
Capillary | ZB-Wax | 2480. | Wu, Zorn, et al., 2007 | 30. m/0.32 mm/0.25 μm, He, 40. C @ 2. min, 5. K/min, 250. C @ 5. min |
Capillary | ZB-Wax | 2484. | Wu, Zorn, et al., 2005 | 30. m/0.32 mm/0.25 μm, He, 40. C @ 2. min, 5. K/min, 250. C @ 5. min |
Capillary | AT-Wax | 2481. | Pino, Almora, et al., 2003 | 60. m/0.32 mm/0.25 μm, He, 65. C @ 10. min, 2. K/min, 250. C @ 60. min |

Normal alkane RI, non-polar column, isothermal

Column type | Active phase | Temperature (C) | I | Reference | Comment |
---|---|---|---|---|---|
Capillary | LM-1 | 210. | 2078. | Filho and Lancas, 1995 | 30. m/0.25 mm/0.25 μm, Hydrogen |

Normal alkane RI, non-polar column, temperature ramp

Column type | Active phase | I | Reference | Comment |
---|---|---|---|---|
Capillary | HP-5 MS | 2098. | Pripdeevech and Saansoomchai, 2013 | 30. m/0.25 mm/0.25 μm, Helium, 3. K/min; Tstart: 60. C; Tend: 230. C |
Capillary | HP-5 MS | 2081. | Vedernikov, Shabanova, et al., 2011 | 30. m/0.25 mm/0.25 μm, Helium, 5. K/min, 280. C @ 5. min; Tstart: 150. C |
Capillary | RTx-1 | 2083. | Dib, Bendahou, et al., 2010 | 60. m/0.22 mm/0.25 μm, Helium, 2. K/min, 230. C @ 35. min; Tstart: 60. C |
Capillary | HP-5 MS | 2098. | Radulovic, Dordevic, et al., 2010 | 30. m/0.25 mm/0.25 μm, Helium, 5. K/min, 290. C @ 10. min; Tstart: 70. C |
Capillary | DB-5 MS | 2087. | Silva, Pott, et al., 2010 | 30. m/0.25 mm/0.25 μm, Helium, 3. K/min; Tstart: 60. C; Tend: 240. C |
Capillary | HP-5 MS | 2107. | Vedernikov and Roschin, 2010 | 30. m/0.25 mm/0.25 μm, Helium, 5. K/min, 280. C @ 10. min; Tstart: 150. C |
Capillary | DB-1 | 2070. | Xu, Tang, et al., 2010 | 30. m/0.25 mm/0.25 μm, Helium, 50. C @ 2. min, 4. K/min, 220. C @ 2. min |
Capillary | HP-5 MS | 2090. | Kim and Chung, 2009 | 30. m/0.25 mm/0.25 μm, Helium, 35. C @ 5. min, 2. K/min, 195. C @ 30. min |
Capillary | DB-5 | 2096. | Scrivanti, Anton, et al., 2009 | 30. m/0.25 mm/0.25 μm, Nitrogen, 2. K/min; Tstart: 40. C; Tend: 230. C |
Capillary | HP-5 MS | 2094. | Zhao, Zeng, et al., 2009 | 30. m/0.25 mm/0.25 μm, Helium, 4. K/min; Tstart: 50. C; Tend: 280. C |
Capillary | VF-5MS | 2110. | Kowalski, 2008 | 30. m/0.25 mm/0.25 μm, Helium, 240. C @ 1. min, 20. K/min; Tend: 320. C |
Capillary | DB-5 MS | 2094. | Noudogbessi, Yedomonhan, et al., 2008 | 30. m/0.25 mm/0.25 μm, Helium, 50. C @ 5. min, 5. K/min, 300. C @ 5. min |
Capillary | RTX-5 MS | 2089. | Edris, Chizzola, et al., 2007 | 30. m/0.25 mm/0.25 μm, He, 60. C @ 2. min, 2. K/min, 200. C @ 10. min |
Capillary | HP-5MS | 2088. | Ferhat, Tigrine-Kordjani, et al., 2007 | 30. m/0.25 mm/0.25 μm, He, 60. C @ 8. min, 2. K/min, 250. C @ 15. min |
Capillary | DB-5 | 2091. | Smelcerovic, Spiteller, et al., 2007 | 30. m/0.25 mm/0.25 μm, He, 10. K/min, 320. C @ 4. min; Tstart: 60. C |
Capillary | HP-5MS | 2093.3 | Zizovic, Stamenic, et al., 2007 | 30. m/0.25 mm/0.25 μm, He, 4. K/min; Tstart: 40. C; Tend: 260. C |
Capillary | DB-5MS | 2079. | Maronigiu, Piras, et al., 2006 | 30. m/0.25 mm/0.25 μm, He, 3. K/min, 280. C @ 30. min; Tstart: 60. C |
Capillary | DB-5 | 2092. | Rout, Naik, et al., 2006 | 30. m/0.25 mm/0.25 μm, He, 2. K/min, 200. C @ 60. min; Tstart: 60. C |
Capillary | DB-5 | 2091. | Shen X., Gao Y., et al., 2006 | 30. m/0.25 mm/0.25 μm, He, 40. C @ 2. min, 4. K/min, 250. C @ 10. min |
Capillary | DB-1 | 2087. | Khanavi, Ghasemian, et al., 2005 | 30. m/0.25 mm/0.25 μm, He, 50. C @ 1. min, 2.5 K/min, 265. C @ 20. min |
Capillary | DB-5 | 2090. | Rout, Misra, et al., 2005 | 25. m/0.25 mm/0.25 μm, He, 2. K/min, 200. C @ 80. min; Tstart: 60. C |
Capillary | HP-5 | 2092. | Saeidnia, Gohari, et al., 2005 | He, 5. K/min; Column length: 30. m; Column diameter: 0.25 mm; Tstart: 60. C; Tend: 240. C |
Capillary | HP-5 | 2075. | N/A | 30. m/0.32 mm/0.25 μm, Helium, 40. C @ 2. min, 5. K/min, 250. C @ 5. min |
Capillary | HP-5 | 2076. | N/A | 30. m/0.32 mm/0.25 μm, Helium, 40. C @ 2. min, 5. K/min, 250. C @ 5. min |
Capillary | HP-5 | 2079. | N/A | 30. m/0.32 mm/0.25 μm, Helium, 40. C @ 2. min, 5. K/min, 250. C @ 5. min |
Capillary | HP-5 | 2079. | N/A | 30. m/0.32 mm/0.25 μm, Helium, 40. C @ 2. min, 5. K/min, 250. C @ 5. min |
Capillary | DB-5 | 2088. | Miyazawa, Fuhita, et al., 2004 | Helium, 2. K/min, 240. C @ 999. min; Column length: 30. m; Column diameter: 0.25 mm; Tstart: 60. C |
Capillary | DB-5 | 2088. | Miyazawa, Fujita, et al., 2004 | Helium, 2. K/min, 240. C @ 999. min; Column length: 50. m; Column diameter: 0.25 mm; Tstart: 60. C |
Capillary | DB-5 | 2094. | Senatore, Rigano, et al., 2004 | 30. m/0.25 mm/0.25 μm, He, 40. C @ 5. min, 2. K/min, 250. C @ 20. min |
Capillary | DB-5 | 2097. | Senatore and Bruno, 2003 | 30. m/0.25 mm/0.25 μm, 40. C @ 5. min, 2. K/min; Tend: 260. C |
Capillary | DB-5 | 2096. | Merle, Blázquez, et al., 2002 | 25. m/0.25 mm/0.25 μm, He, 40. C @ 5. min, 3. K/min, 280. C @ 5. min |
Capillary | SPB-5 | 2090. | Pino, Marbot, et al., 2002 | 30. m/0.25 mm/0.25 μm, Helium, 60. C @ 2. min, 4. K/min, 250. C @ 20. min |
Capillary | DB-5 | 2092. | Tellez, Khan, et al., 2002 | 30. m/0.25 mm/0.25 μm, He, 3. K/min; Tstart: 60. C; Tend: 240. C |
Capillary | DB-5 | 2098. | Palmeira, Conserva, et al., 2001 | 30. m/0.25 mm/0.25 μm, He, 3. K/min; Tstart: 60. C; Tend: 270. C |
Capillary | OV-101 | 2073. | Ehrhardt, Osterroht, et al., 1980 | Hydrogen, 60. C @ 0.5 min, 4. K/min; Column length: 30. m; Column diameter: 0.35 mm; Tend: 270. C |
Capillary | OV-101 | 2073. | Ehrhardt, Osterroht, et al., 1980 | Hydrogen, 60. C @ 0.5 min, 4. K/min; Column length: 30. m; Column diameter: 0.35 mm; Tend: 270. C |

Normal alkane RI, non-polar column, custom temperature program

Column type | Active phase | I | Reference | Comment |
---|---|---|---|---|
Capillary | 2127. | Brandi, Bar, et al., 2011 | Program: not specified | |
Capillary | RTx-1 | 2072. | Dib, Bendahou, et al., 2010 | 60. m/0.22 mm/0.25 μm, Helium; Program: not specified |
Capillary | HP-5 MS | 2097. | Vedernikov and Roschin, 2010 | 30. m/0.25 mm/0.25 μm, Helium; Program: not specified |
Capillary | DB-1 | 2082. | Xu, Tang, et al., 2010 | 30. m/0.25 mm/0.25 μm, Helium; Program: not specified |
Capillary | 5 % Phenyl methyl siloxane | 2123. | Huang, Qin, et al., 2009 | 30. m/0.25 mm/0.25 μm, Helium; Program: 50 0C (2 min) 10 0C/min -> 150 0C 15 0C/min -> 300 0C (10 min) |
Capillary | HP-5MS | 2089. | Moronkola, Ogunwande, et al., 2007 | 30. m/0.25 mm/0.25 μm, He; Program: 40C(10min) => 3C/min => 200C => 2C/min => 220C |
Capillary | OV-1 | 2070. | El-Shazly and Hussein, 2004 | He; Column length: 15. m; Column diameter: 0.317 mm; Program: 50C(4min) => 4C/min => 90C => 10C/min => 300C(10min) |
Capillary | SF-96 | 2067. | Kawasaki, Matsui, et al., 1998 | Column length: 40. m; Column diameter: 0.28 mm; Program: 75C => 3C/min => 190C(25min) => 3C/min => 210C |
Capillary | CP Sil 5 CB | 2090. | Weyerstahl, Marschall, et al., 1998 | He; Column length: 25. m; Program: not specified |
Capillary | OV-1, SE-30, Methyl silicone, SP-2100, OV-101, DB-1, etc. | 2100. | Waggott and Davies, 1984 | Hydrogen; Column length: 50. m; Column diameter: 0.32 mm; Program: not specified |
Other | Methyl Silicone | 2100. | Ardrey and Moffat, 1981 | Program: not specified |

Normal alkane RI, polar column, temperature ramp

Column type | Active phase | I | Reference | Comment |
---|---|---|---|---|
Capillary | AT-Wax | 2472. | Kiss, Csoka, et al., 2011 | 60. m/0.25 mm/0.25 μm, Helium, 4. K/min; Tstart: 60. C; Tend: 280. C |
Capillary | TC-FFAP | 2503. | Kurose and Yatagai, 2005 | 60. m/0.25 mm/0.4 μm, He, 3. K/min, 220. C @ 30. min; Tstart: 60. C |
Capillary | ZB-Wax | 2472. | N/A | 30. m/0.32 mm/0.25 μm, Helium, 40. C @ 2. min, 5. K/min, 250. C @ 5. min |
Capillary | ZB-Wax | 2472. | N/A | 30. m/0.32 mm/0.25 μm, Helium, 40. C @ 2. min, 5. K/min, 250. C @ 5. min |
Capillary | ZB-Wax | 2474. | N/A | 30. m/0.32 mm/0.25 μm, Helium, 40. C @ 2. min, 5. K/min, 250. C @ 5. min |
Capillary | ZB-Wax | 2476. | N/A | 30. m/0.32 mm/0.25 μm, Helium, 40. C @ 2. min, 5. K/min, 250. C @ 5. min |
Capillary | ZB-Wax | 2480. | N/A | 30. m/0.32 mm/0.25 μm, Helium, 40. C @ 2. min, 5. K/min, 250. C @ 5. min |
Capillary | TC-Wax | 2502. | Miyazawa and Okuno, 2003 | He, 4. K/min, 250. C @ 30. min; Column length: 60. m; Column diameter: 0.25 mm; Tstart: 80. C |
Capillary | TC-Wax | 2482. | Miyazawa, Yamafuji, et al., 2003 | 3. K/min; Column length: 60. m; Column diameter: 0.25 mm; Tstart: 80. C; Tend: 240. C |
Capillary | TC-Wax | 2455. | Shuichi, Masazumi, et al., 1996 | 80. C @ 5. min, 3. K/min; Column length: 60. m; Column diameter: 0.25 mm; Tend: 240. C |

Normal alkane RI, polar column, custom temperature program

Column type | Active phase | I | Reference | Comment |
---|---|---|---|---|
Capillary | Innowax FSC | 2509. | Baser, Özek, et al., 2004 | 60. m/0.25 mm/0.25 μm, He; Program: 60C(10min) => 4C/min => 220C(10min) => 1C/min => 240C |
Capillary | Supelcowax 10 | 2483. | Castioni and Kapetanidis, 1996 | 60. m/0.25 mm/0.25 μm, Helium; Program: 60 0C (10 min) 2 0C/min -> 80 0C 3 0C/min -> 100 0C 4 0C/min -> 220 0C (30 min) |

References

Rogers and Siddiqui, 1975
Rogers, D.W.; Siddiqui, N.A.,
Heats of hydrogenation of large molecules. I. Esters of unsaturated fatty acids,
J. Phys. Chem., 1975, 79, 574-577. [all data]
Freedman, Bagby, et al., 1989
Freedman, B.; Bagby, M.O.; Khoury, H.,
Correlation of heats of combustion with empirical formulas for fatty alcohols,
J. Am. Oil Chem. Soc., 1989, 66, 595-596. [all data]
Aldrich Chemical Company Inc., 1990
Aldrich Chemical Company Inc.,
Catalog Handbook of Fine Chemicals, Aldrich Chemical Company, Inc., Milwaukee WI, 1990, 1. [all data]
Althouse and Triebold, 1944
Althouse, Paul M.; Triebold, Howard O.,
Physical Constants of Methyl Esters of Commonly Occurring Fatty Acids Vapor Pressure,
Ind. Eng. Chem. Anal. Ed., 1944, 16, 10, 605-606, https://doi.org/10.1021/i560134a003
. [all data]
Kittiratanapiboon, Jeyashoke, et al., 1998
Kittiratanapiboon, K.; Jeyashoke, N.; Krisnangkura, K.,
The relationship of Kováts retention indices and equivalent chain lengths of fatty acid methyl esters on a methyl silicone capillary column,
J. Chromatogr. Sci., 1998, 36, 7, 361-364, https://doi.org/10.1093/chromsci/36.7.361
. [all data]
Hanai and Hong, 1989
Hanai, T.; Hong, C.,
Structure-retention correlation in CGC,
J. Hi. Res. Chromatogr., 1989, 12, 5, 327-332, https://doi.org/10.1002/jhrc.1240120517
. [all data]
Golovnya, Uralets, et al., 1976
Golovnya, R.V.; Uralets, V.P.; Kuzmenko, T.E.,
Characterization of fatty acid methyl esters by gas chromatography on siloxane liquid phases,
J. Chromatogr., 1976, 121, 1, 118-121, https://doi.org/10.1016/S0021-9673(00)82312-2
. [all data]
Ramsey, Lee, et al., 1980
Ramsey, J.D.; Lee, T.D.; Osselton, M.D.; Moffat, A.C.,
Gas-liquid chromatographic retention indices of 296 non-drug substances on SE-30 or OV-1 likely to be encountered in toxicological analyses,
J. Chromatogr., 1980, 184, 2, 185-206, https://doi.org/10.1016/S0021-9673(00)85641-1
. [all data]
Toda, Mihara, et al., 1983
Toda, H.; Mihara, S.; Umano, K.; Shibamoto, T.,
Photochemical studies on jasmin oil,
J. Agric. Food Chem., 1983, 31, 3, 554-558, https://doi.org/10.1021/jf00117a022
. [all data]
Rezende and Fraga, 2003
Rezende, C.M.; Fraga, S.R.G.,
Chemical and aroma determination of the pulp and seeds of murici (Byrsonima crassifolia L.),
J. Braz. Chem. Soc., 2003, 14, 3, 425-428, https://doi.org/10.1590/S0103-50532003000300014
. [all data]
Benkaci-Ali, Baaliouamer, et al., 2007
Benkaci-Ali, F.; Baaliouamer, A.; Meklati, B.Y.; Chemat, F.,
Chemical composition of seed essential oils from Algerian Nigella sativa extracted by microwave and hydrodistillation,
Flavour Fragr. J., 2007, 22, 2, 148-153, https://doi.org/10.1002/ffj.1773
. [all data]
Rout, Rao, et al., 2007
Rout, P.K.; Rao, Y.R.; Sree., A.; Naik, S.N.,
Composition of essential oil, concrete, absolute, wax and headspace volatiles of Murrarya paniculata (Linn.) Jack flowers,
Flavour Fragr. J., 2007, 22, 5, 352-357, https://doi.org/10.1002/ffj.1804
. [all data]
Wu, Zorn, et al., 2007
Wu, S.; Zorn, H.; Krings, U.; Berger, R.G.,
Volatiles from submerged and surface-cultured beefsteak fungus, Fistulina hepatica,
Flavour Fragr. J., 2007, 22, 1, 53-60, https://doi.org/10.1002/ffj.1758
. [all data]
Zeng, Zhao, et al., 2007
Zeng, Y.-X.; Zhao, C.-X.; Liang, Y.-Z.; Yang, H.; Fang, H.-Z.; Yi, L.-Z.; Zeng, Z.-D.,
Comparative analysis of volatile components from Clematis species growing in China,
Anal. Chim. Acta., 2007, 595, 1-2, 328-339, https://doi.org/10.1016/j.aca.2006.12.022
. [all data]
Blagojevic, Radulovic, et al., 2006
Blagojevic, P.; Radulovic, N.; Palic, R.; Stojanovic, G.,
Chemical composition of the essential oils of Serbian wild-growing Srtemisia absinthium and Artemisia vulgaris,
J. Agric. Food Chem., 2006, 54, 13, 4780-4789, https://doi.org/10.1021/jf060123o
. [all data]
Saroglou, Dorizas, et al., 2006
Saroglou, V.; Dorizas, N.; Kypriotakis, Z.; Skaltsa, H.D.,
Analysis of the essential oil composition of eight Anthemis species from Greece,
J. Chromatogr. A, 2006, 1104, 1-2, 313-322, https://doi.org/10.1016/j.chroma.2005.11.087
. [all data]
Pino, Mesa, et al., 2005
Pino, J.A.; Mesa, J.; Muñoz, Y.; Martí, M.P.; Marbot, R.,
Volatile components from mango (Mangifera indica L.) cultivars,
J. Agric. Food Chem., 2005, 53, 6, 2213-2223, https://doi.org/10.1021/jf0402633
. [all data]
Sati and Mathela, 2005
Sati, S.; Mathela, C.S.,
Essential oil composition of Valeriana hardwickii var. arnottiana from the Himalayas,
Flavour Fragr. J., 2005, 20, 3, 299-301, https://doi.org/10.1002/ffj.1415
. [all data]
Wu, Zorn, et al., 2005
Wu, S.; Zorn, H.; Krings, U.; Berger, R.G.,
Characteristic Volatiles from Young and Aged Fruiting Bodies of Wild Polyporus sulfureus (Bull.:Fr.) Fr.,
J. Agric. Food Chem., 2005, 53, 11, 4524-4528, https://doi.org/10.1021/jf0478511
. [all data]
Zhao, Liang, et al., 2005
Zhao, C.-X.; Liang, Y.-Z.; Fang, H.-Z.; Li, X.-N.,
Temperature-programmed retention indices for gas chromatography-mass spectroscopy analysis of plant essential oils,
J. Chromatogr. A, 2005, 1096, 1-2, 76-85, https://doi.org/10.1016/j.chroma.2005.09.067
. [all data]
Raina, Kumar, et al., 2004
Raina, V.K.; Kumar, A.; Srivastava, S.K.; Syamsundar, K.V.; Kahol, A.P.,
Essential oil composition of 'kewda' (Pandanus odoratissimus) from India,
Flavour Fragr. J., 2004, 19, 5, 434-436, https://doi.org/10.1002/ffj.1331
. [all data]
Senatore, Rigano, et al., 2003
Senatore, F.; Rigano, D.; de Fusco, R.; Bruno, M.,
Volatile components of Centaurea cineraria L. subsp. umbrosa (lacaita) Pign. and Centaurea napifolia L. (Asteraceae), two species growing wild in Sicily,
Flavour Fragr. J., 2003, 18, 3, 248-251, https://doi.org/10.1002/ffj.1179
. [all data]
Tan, Wilkins, et al., 1989
Tan, S.T.; Wilkins, A.L.; Holland, P.T.; McGhie, T.K.,
Extractives from New Zealand unifloral honeys. 2. Degraded carotenoids and other substances from heather honey,
J. Agric. Food Chem., 1989, 37, 5, 1217-1221, https://doi.org/10.1021/jf00089a004
. [all data]
Tan, Holland, et al., 1988
Tan, S.-T.; Holland, P.T.; Wilkins, A.L.; Molan, P.C.,
Extractives from New Zealand honeys. 1. White clovers, manuka, and kanuka unifloral honeys,
J. Agric. Food Chem., 1988, 36, 3, 453-460, https://doi.org/10.1021/jf00081a012
. [all data]
Tret'yakov, 2007
Tret'yakov, K.V.,
Retention Data. NIST Mass Spectrometry Data Center., NIST Mass Spectrometry Data Center, 2007. [all data]
Pino, Almora, et al., 2003
Pino, J.; Almora, K.; Marbot, R.,
Volatile components of papaya (Carica papaya L., maradol variety) fruit,
Flavour Fragr. J., 2003, 18, 6, 492-496, https://doi.org/10.1002/ffj.1248
. [all data]
Filho and Lancas, 1995
Filho, N.R.A.; Lancas, F.M.,
Identification of FAMEs using ECL values and a three-dimensional Kovats retention index system,
J. High Resol. Chromatogr., 1995, 18, 3, 167-170, https://doi.org/10.1002/jhrc.1240180306
. [all data]
Pripdeevech and Saansoomchai, 2013
Pripdeevech, P.; Saansoomchai, J.,
Antibacterial activity and chemical composition of essential oil and various extracts of Fagraea fragrans Roxb. flowers,
Chiang Mai J. Sci., 2013, 40, 2, 214-223. [all data]
Vedernikov, Shabanova, et al., 2011
Vedernikov, D.N.; Shabanova, N.Yu.; Roshchin, V.I.,
Change in the chemical composition of the crust and inner bark of the Betula pendula Roth. Birch (Betulaceae) with tree height,
Rus. J. Bioorg. Chem., 2011, 37, 7, 877-882, https://doi.org/10.1134/S1068162011070259
. [all data]
Dib, Bendahou, et al., 2010
Dib, M.A.; Bendahou, M.; Bendiabdellah, A.; Djabou, N.; Allali, H.; Tabti, B.; Paolini, J.; Costa, J.,
Partial chemical composition and antimicrobial activity of Daucus crinitus Desf. extracts,
Grasas y Aceites, 2010, 61, 3, 271-278, https://doi.org/10.3989/gya.122609
. [all data]
Radulovic, Dordevic, et al., 2010
Radulovic, N.; Dordevic, N.; Markovic, M.; Palic, R.,
Volatile constituents of Glechoma Hirsuta Waldst. Kit. and G. Hederacea L. (Lamiaceae),
Bull. Chem. Soc. Ethiop., 2010, 24, 1, 67-76, https://doi.org/10.4314/bcse.v24i1.52962
. [all data]
Silva, Pott, et al., 2010
Silva, D.B.; Pott, A.; Oliveira, D.C.R.,
Analyses of the headspace volatile constituents of aerial parts (leaves and stems), flowers and fruits of Bidens gardneri Bak. and Bidens sulphurea (Cav.) Sch. Bip. using solid-phase microextraction,
J. Essen. Oil Res., 2010, 22, 6, 560-563, https://doi.org/10.1080/10412905.2010.9700400
. [all data]
Vedernikov and Roschin, 2010
Vedernikov, D.N.; Roschin, V.I.,
Extractive compounds of Birch Buds (Betula pendula Roth.): I. Composition of fatty acids, hydrocarbons , and esters,
Rus. J. Bioorg. Chem., 2010, 36, 7, 894-898, https://doi.org/10.1134/S1068162010070174
. [all data]
Xu, Tang, et al., 2010
Xu, X.; Tang, Z.; Liang, Y.,
Comparative analysis of plant essential oils by GC-MS coupled with integrated chemometric resolution methods,
Anal. Methods, 2010, 2, 4, 359-367, https://doi.org/10.1039/b9ay00213h
. [all data]
Kim and Chung, 2009
Kim, J.-S.; Chung, H.Y.,
GC-MS analysis of the volatile components in dried boxthorn (Lycium chimensis) Fruit,
J. Korean Soc. Appl. Biol. Chem., 2009, 52, 5, 516-524, https://doi.org/10.3839/jksabc.2009.088
. [all data]
Scrivanti, Anton, et al., 2009
Scrivanti, L.R.; Anton, A.M.; Zygadlo, J.A.,
Essential oil conposition of Bothriochloa Kuntze (Poaceae) from South America and their chemotaxonomy,
Biochem. Systematics Ecol., 2009, 37, 3, 206-213, https://doi.org/10.1016/j.bse.2009.03.009
. [all data]
Zhao, Zeng, et al., 2009
Zhao, C.; Zeng, Y.; Wan, M.; Li, R.; Liang, Y.; Li, C.; Zeng, Z.; Chau, F.-T.,
Comparative analysis of essential oils from eight herbal medicines with pungent flavor and cool nature by GC-MS and chemometric resolution methods,
J. Sep. Sci., 2009, 32, 4, 660-670, https://doi.org/10.1002/jssc.200800484
. [all data]
Kowalski, 2008
Kowalski, R.,
Antimicrobial activity of essential oils and extracts of rosinweed (Silphoum trifoliatum and Silphium integrifolium) plants used by the American Indians,
Flav. Fragr. J., 2008, 23, 6, 426-433, https://doi.org/10.1002/ffj.1901
. [all data]
Noudogbessi, Yedomonhan, et al., 2008
Noudogbessi, J.-P.; Yedomonhan, P.; Sohounhloue, D.C.K.; Chalchat, J.-C.; Figueredo, G.,
Chemical composition of essential oil of syzygium guineense (Willd.) DC. var. guineense (Myrtaceae) from Benin,
Rec. Nat. Prod., 2008, 33-38. [all data]
Edris, Chizzola, et al., 2007
Edris, A.E.; Chizzola, R.; Franz, C.,
Isolation and characterization of the volatile aroma compounds from the concrete headspace and the absolute of Jasminum sambac (L.) Ait. (Oleaceae) flowers grown in Egypt,
Eur. Food Res. Technol., 2007, https://doi.org/10.1007/s00217-007-0623-y
. [all data]
Ferhat, Tigrine-Kordjani, et al., 2007
Ferhat, M.A.; Tigrine-Kordjani, N.; Chemat, S.; Meklati, B.Y.; Chemat, F.,
Rapid Extraction of Volatile Compounds Using a New Simultaneous Microwave Distillation: Solvent Extraction Device,
Chromatographia, 2007, 65, 3-4, 217-222, https://doi.org/10.1365/s10337-006-0130-5
. [all data]
Smelcerovic, Spiteller, et al., 2007
Smelcerovic, A.; Spiteller, M.; Ligon, A.P.; Smelcerovic, Z.; Raabe, N.,
Essential oil composition of Hypericum L. species from Southeastern Serbia and their chemotaxonomy,
Biochem. Syst. Ecol., 2007, 35, 2, 99-113, https://doi.org/10.1016/j.bse.2006.09.012
. [all data]
Zizovic, Stamenic, et al., 2007
Zizovic, I.; Stamenic, M.; Ivanovic, J.; Orlovic, A.; Ristic, M.; Djordjevic, S.; Petrovic, S.D.; Skala, D.,
Supercritical carbon dioxide extraction of sesquiterpenes from valerian root,
J. Supercrit. Fluids, 2007, 43, 2, 249-258, https://doi.org/10.1016/j.supflu.2007.05.007
. [all data]
Maronigiu, Piras, et al., 2006
Maronigiu, B.; Piras, A.; Porcedda, S.; Tuveri, E.,
Extraction of Santalum album and Boswellia carterii Birdw. volatile oil by supercritical carbon dioxide: influence of some process parameters,
Flavour Fragr. J., 2006, 21, 4, 718-724, https://doi.org/10.1002/ffj.1718
. [all data]
Rout, Naik, et al., 2006
Rout, P.K.; Naik, S.N.; Rao, Y.R.,
Composition of the concrete, absolute, headspace and essential oil of the flowers of Michelia champaca Linn.,
Flavour Fragr. J., 2006, 21, 6, 906-911, https://doi.org/10.1002/ffj.1742
. [all data]
Shen X., Gao Y., et al., 2006
Shen X.; Gao Y.; Su Q.D.,
Constituents of the essential oil of Rhizoma polygonati,
Flavour Fragr. J., 2006, 21, 3, 556-558, https://doi.org/10.1002/ffj.1666
. [all data]
Khanavi, Ghasemian, et al., 2005
Khanavi, M.; Ghasemian, L.; Motlagh, E.H.; Hadjiakhoondi, A.; Shafiee, A.,
Chemical composition of the essential oils of Marrubium parviflorum Fisch. C.A. Mey. and Marrubium vulgare L. from Iran,
Flavour Fragr. J., 2005, 20, 3, 324-326, https://doi.org/10.1002/ffj.1425
. [all data]
Rout, Misra, et al., 2005
Rout, P.K.; Misra, R.; Sahoo, S.; Sree, A.; Rao, Y.R.,
Extraction of kewda (Pandanus fascicularis Lam.) flowers with hexane: composition of concrete, absolute and wax,
Flavour Fragr. J., 2005, 20, 4, 442-444, https://doi.org/10.1002/ffj.1466
. [all data]
Saeidnia, Gohari, et al., 2005
Saeidnia, S.; Gohari, A.R.; Yassa, N.; Shafiee, A.,
Composition of the volatile oil of Achillea conferta DC. from Iran,
DARU, 2005, 13, 1, 34-36. [all data]
Miyazawa, Fuhita, et al., 2004
Miyazawa, M.; Fuhita, T.; Yamafuji, C.; Matsui, M.; Kasahara, N.; Takagi, Y.; Ishikawa, Y.,
Chemical composition of volatile oil from the roots of Periploca sepium,
J. Oleo Sci., 2004, 53, 10, 511-513, https://doi.org/10.5650/jos.53.511
. [all data]
Miyazawa, Fujita, et al., 2004
Miyazawa, M.; Fujita, T.; Yamafuji, C.; Matsui, M.; Kasahara, N.; Takagi, Y.; Ishikawa, Y.,
Chemical composition of volatile oil from the roots of Periploca sepium,
J. Oleo Sci., 2004, 53, 11, 511-513, https://doi.org/10.5650/jos.53.511
. [all data]
Senatore, Rigano, et al., 2004
Senatore, F.; Rigano, D.; de Fusco, R.; Bruno, M.,
Composition of the essential oil from flowerheads of Chrysanthemum coronarium L. (Asteraceae) growing wild in Southern Italy,
Flavour Fragr. J., 2004, 19, 2, 149-152, https://doi.org/10.1002/ffj.1285
. [all data]
Senatore and Bruno, 2003
Senatore, F.; Bruno, M.,
Composition of the essential oil of Pallenis spinosa (L.) Cass. (Asteraceae),
Flavour Fragr. J., 2003, 18, 3, 195-197, https://doi.org/10.1002/ffj.1180
. [all data]
Merle, Blázquez, et al., 2002
Merle, H.; Blázquez, M.A.; Boira, H.,
Chemical composition of the essential oil of Eriobotrya japonica (Thunb.) Lindl. flowers in the western Mediterranean area
in International Symposium on Loquat, April 11-13, 2002 (CIHEAM-IAMZ, 2003, p. 191-193), Llácer,G.; Badenes,M.L., ed(s)., Centre International de Hautes Etudes Agronomiques Mediterranean, Valencia, Spain, 2002, 191-193. [all data]
Pino, Marbot, et al., 2002
Pino, J.A.; Marbot, R.; Vazquez, C.,
Characterization of volatiles in Loquat fruit (Eriobotrya japonica Lindl.),
Revista CENIC Ciencias Quimicas, 2002, 33, 3, 115-119. [all data]
Tellez, Khan, et al., 2002
Tellez, M.R.; Khan, I.A.; Kobaisy, M.; Schrader, K.K.; Dayan, F.E.; Osbrink, W.,
Composition of the essential oil of Lepidium meyenii (Walp.),
Phytochemistry, 2002, 61, 2, 149-155, https://doi.org/10.1016/S0031-9422(02)00208-X
. [all data]
Palmeira, Conserva, et al., 2001
Palmeira, S.F., Jr.; Conserva, L.M.; Andrade, E.H.A.; Guilhon, G.M.S.P.,
Analysis by GC-MS of the hexane extract of the aerial parts of Aristolochia acutifolia Duchtr.,
Flavour Fragr. J., 2001, 16, 2, 85-88, https://doi.org/10.1002/1099-1026(200103/04)16:2<85::AID-FFJ948>3.0.CO;2-2
. [all data]
Ehrhardt, Osterroht, et al., 1980
Ehrhardt, M.; Osterroht, C.; Petrick, G.,
Fatty-acid methyl esters dissolved in seawater and associated with suspended particulate material,
Marine Chem., 1980, 10, 1, 67-76, https://doi.org/10.1016/0304-4203(80)90059-6
. [all data]
Brandi, Bar, et al., 2011
Brandi, F.; Bar, E.; Mourgues, F.; Horvath, G.; Turcsi, E.; Giuliano, G.; Liverani, A.; Tartarini, S.; Lewinsohn, E.; Rosati, C.,
Study of Redhaven peach and its white-fleshed mutant suggests a key role of CCD4 carotenoid dioxygenase in carotenoid and norisoprenoid volatile metabolism,
BMC Plant Biol., 2011, 11, 24, 1-14. [all data]
Huang, Qin, et al., 2009
Huang, B.; Qin, L.; Chu, Q.; Zhang, Q.; Gao, L.; Zheng, H.,
Comparison of headspace SPME with hydrodistillation and SFE for analysis of the volatile components of the roots of Valeriana officinalis var. latifolia,
Chromatographia, 2009, 69, 5/6, 489-496, https://doi.org/10.1365/s10337-008-0921-y
. [all data]
Moronkola, Ogunwande, et al., 2007
Moronkola, D.O.; Ogunwande, I.A.; Walker, T.M.; Setzer, W.N.; Oyewole, I.O.,
Identification of the main volatile compounds in the leaf and flower of Tithonia diversifolia (Hemsl) Gray,
J. Nat. Med., 2007, 61, 1, 63-66, https://doi.org/10.1007/s11418-006-0019-5
. [all data]
El-Shazly and Hussein, 2004
El-Shazly, A.M.; Hussein, K.T.,
Chemical analysis and biological activities of the essential oil of Teucrium leucocladum Boiss. (Lamiaceae),
Biochem. Syst. Ecol., 2004, 32, 7, 665-674, https://doi.org/10.1016/j.bse.2003.12.009
. [all data]
Kawasaki, Matsui, et al., 1998
Kawasaki, W.; Matsui, K.; Akakabe, Y.; Itai, N.; Kajiwara, T.,
Long-chain aldehyde-forming activity in tobacco leaves,
Phytochemistry, 1998, 49, 6, 1565-1568, https://doi.org/10.1016/S0031-9422(98)00236-2
. [all data]
Weyerstahl, Marschall, et al., 1998
Weyerstahl, P.; Marschall, H.; Weirauch, M.; Thefeld, K.; Surburg, H.,
Constituents of commercial Labdanum oil,
Flavour Fragr. J., 1998, 13, 5, 295-318, https://doi.org/10.1002/(SICI)1099-1026(1998090)13:5<295::AID-FFJ751>3.0.CO;2-I
. [all data]
Waggott and Davies, 1984
Waggott, A.; Davies, I.W.,
Identification of organic pollutants using linear temperature programmed retention indices (LTPRIs) - Part II, 1984, retrieved from http://dwi.defra.gov.uk/research/completed-research/reports/dwi0383.pdf. [all data]
Ardrey and Moffat, 1981
Ardrey, R.E.; Moffat, A.C.,
Gas-liquid chromatographic retention indices of 1318 substances of toxicological interest on SE-30 or OV-1 stationary phase,
J. Chromatogr., 1981, 220, 3, 195-252, https://doi.org/10.1016/S0021-9673(00)81925-1
. [all data]
Kiss, Csoka, et al., 2011
Kiss, M.; Csoka, M.; Gyorfi, J.; Korany, K.,
Comparison of the fragrance constituents of Tuber aestivium and Tuber Brumale gathered in Hungary,
J. Appl. Botany Food Quality, 2011, 84, 102-110. [all data]
Kurose and Yatagai, 2005
Kurose, K.; Yatagai, M.,
Components of the essential oils of Azadirachta indica A. Juss, Azadirachta siamensis Velton, and Azadirachta excelsa (Jack) Jacobs and their comparison,
J. Wood Sci., 2005, 51, 2, 185-188, https://doi.org/10.1007/s10086-004-0640-4
. [all data]
Miyazawa and Okuno, 2003
Miyazawa, M.; Okuno, Y.,
Volatile components from the roots of Scrophularia ningpoensis Hemsl.,
Flavour Fragr. J., 2003, 18, 5, 398-400, https://doi.org/10.1002/ffj.1232
. [all data]
Miyazawa, Yamafuji, et al., 2003
Miyazawa, M.; Yamafuji, C.; Kurose, K.; Ishikawa, Y.,
Volatile components of the rhizomes of Cirsium japonicum DC,
Flavour Fragr. J., 2003, 18, 1, 15-17, https://doi.org/10.1002/ffj.1135
. [all data]
Shuichi, Masazumi, et al., 1996
Shuichi, H.; Masazumi, N.; Hiromu, K.; Kiyoshi, F.,
Comparison of volatile compounds berween the crude drugs, Onji-tsutsu and Onji-niki,
Nippon nogei kagaku kaishi, 1996, 70, 2, 151-160. [all data]
Baser, Özek, et al., 2004
Baser, K.H.C.; Özek, T.; Kirimer, N.; Deliorman, D.; Ergun, F.,
Composition of the essential oils of Galium aparine L. and Galium odoratum (L.) Scop. from Turkey,
J. Essent. Oil Res., 2004, 16, 4, 305-307, https://doi.org/10.1080/10412905.2004.9698728
. [all data]
Castioni and Kapetanidis, 1996
Castioni, P.; Kapetanidis, I.,
Volatile constituents from Brunfelsia grandiflora ssp. grandiflora: qualitative analysis by GC-MS,
Scientia Pharmaceutica, 1996, 64, 83-91. [all data]