Diethylene glycol hexyl ether
- Formula: C10H22O3
- Molecular weight: 190.2799
- IUPAC Standard InChIKey: GZMAAYIALGURDQ-UHFFFAOYSA-N
- CAS Registry Number: 112-59-4
- Chemical structure:
View 3d structure (requires JavaScript / HTML 5) - Other names: 2-(2-Hexyloxyethoxy)ethanol; Diethylene glycol mono-n-hexyl ether; Diethylene glycol monohexyl ether; Ethanol, 2-[2-(hexyloxy)ethoxy]-; n-Hexoxyethoxyethanol; n-Hexyl Carbitol; Diethylene glycol n-hexyl ether; Hexol carbitol; Hexyl carbitol; 3,6-Dioxadodecanol-1; 3,6-Dioxa-1-dodecanol; Hexylkarbitol; NSC 403666; Ucar Filmer EHC

Phase change data

Data compiled as indicated in comments:
BS - Robert L. Brown and Stephen E. Stein
AC - William E. Acree, Jr., James S. Chickos
Quantity | Value | Units | Method | Reference | Comment |
---|---|---|---|---|---|
Tboil | 533.2 | K | N/A | Aldrich Chemical Company Inc., 1990 | BS |
Quantity | Value | Units | Method | Reference | Comment |
ΔvapH° | 20.7 | kcal/mol | EB | Chylinski, Fras, et al., 2004 | Based on data from 403. to 423. K.; AC |
Enthalpy of vaporization
ΔvapH (kcal/mol) | Temperature (K) | Method | Reference | Comment |
---|---|---|---|---|
15.0 | 421. | A | Stephenson and Malanowski, 1987 | Based on data from 406. to 531. K.; AC |

Kovats' RI, non-polar column, isothermal

Column type | Active phase | Temperature (C) | I | Reference | Comment |
---|---|---|---|---|---|
Packed | SE-30 | 170. | 1363. | Voelkel, 1987 | He, Chromaton N Super (75-100 mesh); Column length: 1. m |

References

Aldrich Chemical Company Inc., 1990
Aldrich Chemical Company Inc.,
Catalog Handbook of Fine Chemicals, Aldrich Chemical Company, Inc., Milwaukee WI, 1990, 1. [all data]
Chylinski, Fras, et al., 2004
Chylinski, Krzysztof; Fras, Zbigniew; Malanowski, Stanislaw K.,
Vapor-Liquid Equilibrium for Propylene Glycol + 2-(2-Hexyloxyethoxy)ethanol and 1-Methyl-2-pyrrolidone + 1-Methoxypropan-2-ol «8224»,
J. Chem. Eng. Data, 2004, 49, 1, 18-23, https://doi.org/10.1021/je034096z
. [all data]
Stephenson and Malanowski, 1987
Stephenson, Richard M.; Malanowski, Stanislaw,
Handbook of the Thermodynamics of Organic Compounds, 1987, https://doi.org/10.1007/978-94-009-3173-2
. [all data]
Voelkel, 1987
Voelkel, A.,
Retention Indices and Thermodynamic Functions of Solution for Model Non-Ionic Surfactants in Standard Stationary Phases Determined by Gas Chromatography,
J. Chromatogr., 1987, 387, 95-104, https://doi.org/10.1016/S0021-9673(01)94516-9
. [all data]