Tetraethylenepentamine
- Formula: C8H23N5
- Molecular weight: 189.3017
- IUPAC Standard InChIKey: FAGUFWYHJQFNRV-UHFFFAOYSA-N
- CAS Registry Number: 112-57-2
- Chemical structure:
View 3d structure (requires JavaScript / HTML 5) - Other names: 1,2-Ethanediamine, N-(2-aminoethyl)-N'-[2-[(2-aminoethyl)amino]ethyl]-; 1,11-Diamino-3,6,9-triazaundecane; 3,6,9-Triazaundecane-1,11-diamine; Tetraethylenpentamine; 3,6,9-Triazaundecamethylenediamine; Tetren; 1,4,7,10,13-Pentaazatridecane; D.E.H. 26; UN 2320; TEPA; Texlin 400; 1,2-Ethanediamine, N1-(2-aminoethyl)-N2-[2-[(2-aminoethyl)amino]ethyl]-; DEH 26; N-(2-Aminoethyl)-N'-(2-((2-aminoethyl)amino)ethyl)-1,2-ethanediamine; NSC 88603

Condensed phase thermochemistry data

Data compiled by: Eugene S. Domalski and Elizabeth D. Hearing
Constant pressure heat capacity of liquid
Cp,liquid (J/mol*K) | Temperature (K) | Reference | Comment |
---|---|---|---|
460. | 333. | Bobylev, Kamskaya, et al., 1988 | T = 333 to 513 K. |

Phase change data

Data compiled as indicated in comments:
BS - Robert L. Brown and Stephen E. Stein
AC - William E. Acree, Jr., James S. Chickos
Quantity | Value | Units | Method | Reference | Comment |
---|---|---|---|---|---|
Tboil | 613.2 | K | N/A | Aldrich Chemical Company Inc., 1990 | BS |
Enthalpy of vaporization
ΔvapH (kJ/mol) | Temperature (K) | Method | Reference | Comment |
---|---|---|---|---|
71.3 | 478. | A | Stephenson and Malanowski, 1987 | Based on data from 464. to 615. K.; AC |

Reaction thermochemistry data

Data compiled by: Hussein Y. Afeefy, Joel F. Liebman, and Stephen E. Stein
Individual Reactions
By formula: C6H18N4 + C2H5N = C8H23N5
Quantity | Value | Units | Method | Reference | Comment |
---|---|---|---|---|---|
ΔrH° | 83.3 ± 4.6 | kJ/mol | Cm | Dalin, Bobylev, et al., 1988 | liquid phase; solvent: Aqueous HCl; Kinetic |

References

Bobylev, Kamskaya, et al., 1988
Bobylev, V.A.; Kamskaya, O.I.; Kossoi, A.A.; Koludarova, E.Yu.,
Investigation of the heat capacity of ethyleneamines by differential scanning calorimetry,
Zhur. Obshch. Khim., 1988, 58, 2536-2538. [all data]
Aldrich Chemical Company Inc., 1990
Aldrich Chemical Company Inc.,
Catalog Handbook of Fine Chemicals, Aldrich Chemical Company, Inc., Milwaukee WI, 1990, 1. [all data]
Stephenson and Malanowski, 1987
Stephenson, Richard M.; Malanowski, Stanislaw,
Handbook of the Thermodynamics of Organic Compounds, 1987, https://doi.org/10.1007/978-94-009-3173-2
. [all data]
Dalin, Bobylev, et al., 1988
Dalin, A.R.; Bobylev, V.A.; Suslikov, V.F.; Kamskaya, O.I.; Tereshchenko, G.F.,
Nucleophilic cleavage and the formation of saturated heterocycles. VII. Kinetic and thermochemical study of reactions of aziridine with ethylene amines,
J. Gen. Chem. USSR, 1988, 58, 1868-1871. [all data]