1-Dodecanethiol
- Formula: C12H26S
- Molecular weight: 202.400
- IUPAC Standard InChIKey: WNAHIZMDSQCWRP-UHFFFAOYSA-N
- CAS Registry Number: 112-55-0
- Chemical structure:
View 3d structure (requires JavaScript / HTML 5) - Other names: n-Dodecanethiol; n-Dodecyl mercaptan; n-Lauryl mercaptan; Dodecane-1-thiol; Dodecyl mercaptan; Lauryl mercaptan; 1-Dodecyl mercaptan; 1-Mercaptododecane; Dodecylthiol; Dodecanethiol-(1); NCI-C60935; Pennfloat M; Pennfloat S; n-Dodecylthiol; 1-Dodecylthiol; NSC 814

Condensed phase thermochemistry data

Data compiled by: Eugene S. Domalski and Elizabeth D. Hearing
Constant pressure heat capacity of liquid
Cp,liquid (J/mol*K) | Temperature (K) | Reference | Comment |
---|---|---|---|
442.81 | 300. | Tutubalina, Gabdrakhmanov, et al., 1982 | T = 273 to 373 K. Cp = 423.01 + 3.878x10-2 T + 9.070x10-5 T2. |

Phase change data

Data compiled as indicated in comments:
BS - Robert L. Brown and Stephen E. Stein
AC - William E. Acree, Jr., James S. Chickos
Quantity | Value | Units | Method | Reference | Comment |
---|---|---|---|---|---|
Tboil | 547.7 | K | N/A | Aldrich Chemical Company Inc., 1990 | BS |
Reduced pressure boiling point
Tboil (K) | Pressure (bar) | Reference | Comment |
---|---|---|---|
416.7 | 0.020 | Weast and Grasselli, 1989 | BS |
Enthalpy of vaporization
ΔvapH (kJ/mol) | Temperature (K) | Reference | Comment |
---|---|---|---|
62.0 | 435. | Dykyj, Svoboda, et al., 1999 | Based on data from 420. to 581. K.; AC |

Kovats' RI, non-polar column, isothermal

View large format table.

Column type Active phase Temperature (C) I Reference Comment
PackedApiezon M130.1536.Garbuzov, Misharina, et al., 1985He or N2, Chromosorb W, AW-DMCS; Column length: 2.1 m
PackedSE-30130.1520.Golovnya and Arsen'ev, 1970Column length: 1.5 m

Kovats' RI, non-polar column, custom temperature program

View large format table.

Column type Active phase I Reference Comment
CapillaryApiezon M1536.Zhu, Wang, et al., 2007Program: not specified

Kovats' RI, polar column, custom temperature program

View large format table.

Column type Active phase I Reference Comment
CapillaryPEG-20M1773.Zhu, Wang, et al., 2007Program: not specified

References

Tutubalina, Gabdrakhmanov, et al., 1982
Tutubalina, V.P.; Gabdrakhmanov, F.G.; Konyukhova, T.M.,
Study of the heat capacity of n-sulfides, 1982, Teplo-Massoobmen Khim. [all data]
Aldrich Chemical Company Inc., 1990
Aldrich Chemical Company Inc.,
Catalog Handbook of Fine Chemicals, Aldrich Chemical Company, Inc., Milwaukee WI, 1990, 1. [all data]
Weast and Grasselli, 1989
CRC Handbook of Data on Organic Compounds, 2nd Editon, Weast,R.C and Grasselli, J.G., ed(s)., CRC Press, Inc., Boca Raton, FL, 1989, 1. [all data]
Dykyj, Svoboda, et al., 1999
Dykyj, J.; Svoboda, J.; Wilhoit, R.C.; Frenkel, M.L.; Hall, K.R.,
Vapor Pressure of Chemicals: Part A. Vapor Pressure and Antoine Constants for Hydrocarbons and Sulfur, Selenium, Tellurium and Hydrogen Containing Organic Compounds, Springer, Berlin, 1999, 373. [all data]