Dodecanal
- Formula: C12H24O
- Molecular weight: 184.3184
- IUPAC Standard InChIKey: HFJRKMMYBMWEAD-UHFFFAOYSA-N
- CAS Registry Number: 112-54-9
- Chemical structure:
View 3d structure (requires JavaScript / HTML 5) - Other names: Lauraldehyde; n-Dodecanal; n-Dodecyl aldehyde; n-Dodecylic aldehyde; n-Lauraldehyde; Aldehyde C-12; Dodecanaldehyde; Dodecyl aldehyde; Lauric aldehyde; Lauryl aldehyde; 1-Dodecanal; C-12 aldehyde, lauric; 1-Dodecyl aldehyde; Duodecylic aldehyde; Laurinaldehyde; Aldehyde C-12, lauric; NSC 46128

Phase change data

Data compiled as indicated in comments:
TRC - Thermodynamics Research Center, NIST Boulder Laboratories, Chris Muzny director
BS - Robert L. Brown and Stephen E. Stein
AC - William E. Acree, Jr., James S. Chickos
Quantity | Value | Units | Method | Reference | Comment |
---|---|---|---|---|---|
Tboil | 511.15 | K | N/A | Davies and Hodgson, 1943 | Uncertainty assigned by TRC = 5. K; TRC |
Tboil | 504.15 | K | N/A | Sigmund, 1929 | Uncertainty assigned by TRC = 5. K; TRC |
Quantity | Value | Units | Method | Reference | Comment |
Tfus | 310. ± 30. | K | AVG | N/A | Average of 7 values; Individual data points |
Quantity | Value | Units | Method | Reference | Comment |
ΔvapH° | 68.3 ± 0.9 | kJ/mol | GS | Verevkin, Krasnykh, et al., 2003 | Based on data from 314. to 347. K.; AC |
ΔvapH° | 70.2 | kJ/mol | CGC | Koutek, Hoskovec, et al., 1996 | Based on data from 308. to 353. K. See also Ova, Koultek, et al., 2000.; AC |
Reduced pressure boiling point
Tboil (K) | Pressure (bar) | Reference | Comment |
---|---|---|---|
458.2 | 0.133 | Weast and Grasselli, 1989 | BS |
Enthalpy of vaporization
ΔvapH (kJ/mol) | Temperature (K) | Method | Reference | Comment |
---|---|---|---|---|
56.5 | 365. | A | Stephenson and Malanowski, 1987 | Based on data from 350. to 530. K. See also Stull, 1947.; AC |
Antoine Equation Parameters
log10(P) = A − (B / (T + C))
P = vapor pressure (bar)
T = temperature (K)
View plot Requires a JavaScript / HTML 5 canvas capable browser.
Temperature (K) | A | B | C | Reference | Comment |
---|---|---|---|---|---|
350.8 to 530. | 5.24241 | 2651.435 | -24.206 | Stull, 1947 | Coefficents calculated by NIST from author's data. |

Van Den Dool and Kratz RI, non-polar column, custom temperature program

Data compiled by: NIST Mass Spectrometry Data Center, William E. Wallace, director

Column type CapillaryCapillaryCapillaryCapillaryCapillary
Active phase BPX-5SE-52DB-5MSCP Sil 8 CBBP-1
Column length (m) 30.25.30.60.
Carrier gas HeH2He
Substrate
Column diameter (mm) 0.250.320.250.25
Phase thickness (μm) 0.250.430.250.25
Program 35C => 4C/min => 200C => 30C/min => 300C (3min)60C(8min) => 3C/min => 180C => 20C/min => 250C(10min)40C(5min) => 4C/min => 160C => 8C/min => 240C (15min)0C => rapidly => 40C(8min) => 4C/min => 250C(10min)not specified
I 1415.1408.1411.1418.1388.
ReferenceDharmawan, Kasapis, et al., 2007Frizzo, Lorenzo, et al., 2004Kim, Lee, et al., 2003Duckham, Dodson, et al., 2001Filippini, Tomi, et al., 2000
Comment MSDC-RI MSDC-RI MSDC-RI MSDC-RI MSDC-RI
Column type CapillaryCapillary
Active phase DB-1SE-52
Column length (m) 15.60.
Carrier gas HeHe
Substrate
Column diameter (mm) 0.530.32
Phase thickness (μm) 1.0.40
Program 40C(3min) => 8C/min => 200(1min) => 5C/min => 300C(25min)45 C (6 min) 3 C/min -> 111 0C 2 C/min -> 160 C 3 C/min -> 300 C (15 min)
I 1388.1408.
ReferencePeng, 2000Mondello, Dugo, et al., 1995
Comment MSDC-RI MSDC-RI

Kovats' RI, polar column, temperature ramp

Data compiled by: NIST Mass Spectrometry Data Center, William E. Wallace, director

Column type CapillaryCapillary
Active phase DB-WaxDB-Wax
Column length (m) 60.60.
Carrier gas HeHe
Substrate
Column diameter (mm) 0.250.25
Phase thickness (μm) 0.250.25
Tstart (C) 40.40.
Tend (C) 200.200.
Heat rate (K/min) 3.3.
Initial hold (min) 5.5.
Final hold (min)
I 1709.1710.
ReferenceTatsuka, Suekane, et al., 1990Tatsuka, Suekane, et al., 1990
Comment MSDC-RI MSDC-RI

Normal alkane RI, polar column, custom temperature program

Data compiled by: NIST Mass Spectrometry Data Center, William E. Wallace, director

Column type CapillaryCapillaryCapillaryCapillaryCapillary
Active phase Supelco CO Wax-10DB-WaxDB-WaxDB-WaxInnowax
Column length (m) 60.30.30.30.60.
Carrier gas HeliumHeliumHeliumHelium
Substrate
Column diameter (mm) 0.320.250.250.250.25
Phase thickness (μm) 0.250.250.250.250.33
Program 35 0C (6 min) 2 0C/min -> 60 0C (5 min) 5 0C/min -> 200 0C 25 0C/min -> 250 0C (6 min)not specifiednot specifiednot specifiednot specified
I 1713.1710.1720.1733.1724.
ReferencePrompona, Kandylis, et al., 2012Welke, Manfroi, et al., 2012Welke, Manfroi, et al., 2012Welke, Manfroi, et al., 2012Noorizadeh, Farmany, et al., 2011
Comment MSDC-RI MSDC-RI MSDC-RI MSDC-RI MSDC-RI
Column type CapillaryCapillaryCapillaryCapillaryCapillary
Active phase DB-WaxHP Innowax FSPInnowax FSCInnowax FSCHP-Innowax FSC
Column length (m) 60.60.60.60.60.
Carrier gas HeliumHeliumHeHe
Substrate
Column diameter (mm) 0.250.250.250.250.25
Phase thickness (μm) 0.250.250.250.250.25
Program 40 0C (3 min) 2 0C/min -> 150 0C 4 0C/min -> 220 0C (20 min)60 0C (10 min) 4 0C/min -> 220 0C (10 min) 1 0C/min -> 240 0C (20 min)60C(10min) => 4C/min => 220C (10min) => 1C/min => 240C60C(10min) => 4C/min >220C (10min) => 1C/min => 240C60C(10min) => 4C/min => 220C (10min) => 1C/min => 240C
I 1689.1722.1722.1732.1722.
ReferenceGyawali and Kim, 2009Wedge, Klun, et al., 2009Baser K.H.C., Ozek G., et al., 2006Baser, Özek, et al., 2006Tabanca, Demirci, et al., 2006
Comment MSDC-RI MSDC-RI MSDC-RI MSDC-RI MSDC-RI
Column type CapillaryCapillaryCapillaryCapillaryCapillary
Active phase Carbowax 20MCarbowax 20MHP-Innowax FSCHP Innowax FSPCarbowax 20M
Column length (m)   60.60.
Carrier gas   HeN2
Substrate
Column diameter (mm)   0.250.25
Phase thickness (μm)   0.250.25
Program not specifiednot specified60C(10min) => 4C/min => 220C(10min) => 1C/min => 240C60C(10min) => 4C/min => 220C(10min) => 1C/min => 240Cnot specified
I 1685.1687.1722.1722.1695.
ReferenceEditorial paper, 2005Editorial paper, 2005Tabanca, Demirci, et al., 2005Altintas, Kose, et al., 2004Vinogradov, 2004
Comment MSDC-RI MSDC-RI MSDC-RI MSDC-RI MSDC-RI
Column type CapillaryCapillaryCapillaryCapillary
Active phase FFAPHP-Innowax FSCInnowax FSCDB-Wax
Column length (m) 30.60.60.60.
Carrier gas  HeHeN2
Substrate
Column diameter (mm) 0.320.250.25
Phase thickness (μm) 0.250.250.250.25
Program 35C (2min) => 40C/min => 60C (2min) => 6C/min => 180C => 10C/min => 230C (10min60C (10min) => 4C/min => 220C (10min) => 1C/min => 240C60C(10 min) => 4C/min => 220C(10min) => 1C/min => 240Cnot specified
I 1695.1722.1722.1697.
ReferenceBuettner, Mestres, et al., 2003Demirci, Baser, et al., 2003Kirimer, Tabanca, et al., 2000Weyerstahl, Marschall, et al., 1998
Comment MSDC-RI MSDC-RI MSDC-RI MSDC-RI

Kovats' RI, non-polar column, custom temperature program

Data compiled by: NIST Mass Spectrometry Data Center, William E. Wallace, director

Column type CapillaryCapillary
Active phase HP-5MSBP-1
Column length (m) 30.30.
Carrier gas HeN2
Substrate
Column diameter (mm) 0.250.32
Phase thickness (μm) 0.250.25
Program 40C(3min) => 3C/min => 160C => 10C/min => 200C60C => 5C/min => 220C (5min) => 3C/min => 245C(5min)
I 1412.1395.
ReferenceAlissandrakis E., Tarantilis P.A., et al., 2007Khan, Verma, et al., 2006
Comment MSDC-RI MSDC-RI

Lee's RI, non-polar column, custom temperature program

Data compiled by: NIST Mass Spectrometry Data Center, William E. Wallace, director

Column type Capillary
Active phase DB-5
Column length (m) 60.
Carrier gas
Substrate
Column diameter (mm)
Phase thickness (μm)
Program not specified
I 182.4
ReferenceFuentes, Font, et al., 2007
Comment MSDC-RI

References

Davies and Hodgson, 1943
Davies, R.R.; Hodgson, H.H.,
Catalytic Recuction fy Formic Acid Under Pressure I. The Preparation of Aldehydes From Carboxylic Acids With Titanium Dioxide as Catalyst,
J. Chem. Soc., 1943, 1943, 84. [all data]
Sigmund, 1929
Sigmund, F.,
Monatsh. Chem., 1929, 52, 185. [all data]
Verevkin, Krasnykh, et al., 2003
Verevkin, Sergey P.; Krasnykh, Eugen L.; Vasiltsova, Tatiana V.; Koutek, Bohumir; Doubsky, Jan; Heintz, Andreas,
Vapor pressures and enthalpies of vaporization of a series of the linear aliphatic aldehydes,
Fluid Phase Equilibria, 2003, 206, 1-2, 331-339, https://doi.org/10.1016/S0378-3812(03)00035-9
. [all data]
Koutek, Hoskovec, et al., 1996
Koutek, Bohumir; Hoskovec, Michal; Vrkocov, Pavlína; Konecný, Karel; Feltl, Ladislav; Vrkoc, Jan,
Gas chromatographic determination of vapour pressures of pheromone-like compounds III. Aldehydes,
Journal of Chromatography A, 1996, 719, 2, 391-400, https://doi.org/10.1016/0021-9673(95)00740-7
. [all data]
Ova, Koultek, et al., 2000
Ova, P.V.; Koultek, B.; Hoskovec, M.,
Practice Oriented Results on Use and Production of Neem Ingredients and Pheromones VI, H. Kleeberg and C.P.W. Zebitz, ed(s)., Druck and Graphic, Giessen, 2000, 211-218. [all data]
Weast and Grasselli, 1989
CRC Handbook of Data on Organic Compounds, 2nd Editon, Weast,R.C and Grasselli, J.G., ed(s)., CRC Press, Inc., Boca Raton, FL, 1989, 1. [all data]
Stephenson and Malanowski, 1987
Stephenson, Richard M.; Malanowski, Stanislaw,
Handbook of the Thermodynamics of Organic Compounds, 1987, https://doi.org/10.1007/978-94-009-3173-2
. [all data]
Stull, 1947
Stull, Daniel R.,
Vapor Pressure of Pure Substances. Organic and Inorganic Compounds,
Ind. Eng. Chem., 1947, 39, 4, 517-540, https://doi.org/10.1021/ie50448a022
. [all data]