Phenyldimethylvinylsilane
- Formula: C10H14Si
- Molecular weight: 162.3037
- IUPAC Standard InChIKey: QDEZCOQKJSRQNN-UHFFFAOYSA-N
- CAS Registry Number: 1125-26-4
- Chemical structure:
View 3d structure (requires JavaScript / HTML 5) - Other names: Dimethyl(phenyl)(vinyl)silane; Silane, ethenyldimethylphenyl-; Silane, dimethylphenylvinyl-; Vinylphenyldimethylsilane; Dimethylvinylphenylsilane; Ethenyldimethylphenylsilane; Vinyldimethylphenylsilane

Condensed phase thermochemistry data

Data compiled by: Eugene S. Domalski and Elizabeth D. Hearing
Quantity | Value | Units | Method | Reference | Comment |
---|---|---|---|---|---|
S°liquid | 374.8 | J/mol*K | N/A | Lebedev, Lebedev, et al., 1981 | |
S°liquid | 374.8 | J/mol*K | N/A | Lebedev, Rabinovich, et al., 1977 | |
S°liquid | 376.6 | J/mol*K | N/A | Lebedev and Aron, 1974 |
Constant pressure heat capacity of liquid
Cp,liquid (J/mol*K) | Temperature (K) | Reference | Comment |
---|---|---|---|
284.8 | 298.15 | Lebedev, Lebedev, et al., 1981 | T = 5 to 330 K. |
284.8 | 298.15 | Lebedev, Rabinovich, et al., 1977 | T = 60 to 300 K. |
285.6 | 300. | Lebedev and Aron, 1974 | T = 50 to 300 K. |

Phase change data

Data compiled as indicated in comments:
TRC - Thermodynamics Research Center, NIST Boulder Laboratories, Chris Muzny director
DH - Eugene S. Domalski and Elizabeth D. Hearing
AC - William E. Acree, Jr., James S. Chickos
Quantity | Value | Units | Method | Reference | Comment |
---|---|---|---|---|---|
Ttriple | 190.70 | K | N/A | Lebedev, Lebedev, et al., 1981, 2 | Uncertainty assigned by TRC = 0.02 K; TRC |
Ttriple | 190.70 | K | N/A | Lebedev, Rabinovich, et al., 1977, 2 | Uncertainty assigned by TRC = 0.02 K; TRC |
Enthalpy of fusion
ΔfusH (kJ/mol) | Temperature (K) | Reference | Comment |
---|---|---|---|
12.300 | 190.70 | Lebedev, Lebedev, et al., 1981 | DH |
12.259 | 190.70 | Lebedev, Rabinovich, et al., 1977 | DH |
12.259 | 190.70 | Lebedev and Aron, 1974 | DH |
12.26 | 190.7 | Domalski and Hearing, 1996 | AC |
Entropy of fusion
ΔfusS (J/mol*K) | Temperature (K) | Reference | Comment |
---|---|---|---|
64.4 | 190.70 | Lebedev, Lebedev, et al., 1981 | DH |
64.4 | 190.70 | Lebedev, Rabinovich, et al., 1977 | DH |
64.3 | 190.70 | Lebedev and Aron, 1974 | DH |

References

Lebedev, Lebedev, et al., 1981
Lebedev, B.V.; Lebedev, N.K.; Khotimskii, V.S.; Durgar'yan, S.G.; Nametkin, N.S.,
Thermodynamics of polymerization of vinylorganosilanes,
Dokl. Akad. Nauk, 1981, SSSR 259, 629-633. [all data]
Lebedev, Rabinovich, et al., 1977
Lebedev, B.V.; Rabinovich, I.B.; Lebedev, N.K.; Tsvetkov, V.G.; Durgar'yan, S.G.; Khotimskii, V.S.,
Thermodynamics of vinyldimethylphenylsilane and polyvinyldimethylphenylsilane and the polymerization of vinyldimethylphenylsilane,
Vysokomol. Soedin., 1977, A19, 513-518. [all data]
Lebedev and Aron, 1974
Lebedev, B.V.; Aron, B.M.,
Heat capacity and thermodynamic functions of vinyldimethylphenylsilane,
Tr. Khim. Khim. Tekhnol., 1974, (1), 75-77. [all data]
Lebedev, Lebedev, et al., 1981, 2
Lebedev, B.V.; Lebedev, N.K.; Khotimskii, V.S.; Durgar'yan, S.G.; Nametkin, N.S.,
Thermodynamics of polymerization of vinylorganosilanes,
Dokl. Akad. Nauk SSSR, 1981, 259, 629. [all data]
Lebedev, Rabinovich, et al., 1977, 2
Lebedev, B.V.; Rabinovich, I.B.; Lebedev, N.K.; Tsvetkov, V.G.; Durgar'yan, S.G.; Khotimskii, V.S.,
Thermodynamics of Vinyldimethylphenylsilane and Polyvinydimethylphenyl- silane and the Polymerization of Vinyldimethylphenylsilane,
Vysokomol. Soedin. A, 1977, 19, 513. [all data]
Domalski and Hearing, 1996
Domalski, Eugene S.; Hearing, Elizabeth D.,
Heat Capacities and Entropies of Organic Compounds in the Condensed Phase. Volume III,
J. Phys. Chem. Ref. Data, 1996, 25, 1, 1, https://doi.org/10.1063/1.555985
. [all data]