Bicyclo[3.1.0]hexan-3-one, 4-methyl-1-(1-methylethyl)-
- Formula: C10H16O
- Molecular weight: 152.2334
- IUPAC Standard InChIKey: USMNOWBWPHYOEA-UHFFFAOYSA-N
- CAS Registry Number: 1125-12-8
- Chemical structure:
View 3d structure (requires JavaScript / HTML 5) - Species with the same structure:
- Stereoisomers:
- Other names: 3-Thujanone; Chrysanthone; Tanacetone; 1-Isopropyl-4-methylbicyclo[3.1.0]hexan-3-one; (-)-Thujone; Thujan-3-one; NSC 407281; Thujone

Condensed phase thermochemistry data

Data compiled by: Hussein Y. Afeefy, Joel F. Liebman, and Stephen E. Stein
Quantity | Value | Units | Method | Reference | Comment |
---|---|---|---|---|---|
ΔcH°liquid | -5991.1 | kJ/mol | Ccb | Roth and Ostling, 1913 | Corresponding ΔfHºliquid = -231. kJ/mol (simple calculation by NIST; no Washburn corrections) |

Phase change data

Data compiled by: Robert L. Brown and Stephen E. Stein
Quantity | Value | Units | Method | Reference | Comment |
---|---|---|---|---|---|
Tboil | 358.2 | K | N/A | Aldrich Chemical Company Inc., 1990 |

References

Roth and Ostling, 1913
Roth, W.A.; Ostling, G.J.,
Thermochemische Untersuchungen in der alicyclischen Reihe,
Ber., 1913, 46, 309-327. [all data]
Aldrich Chemical Company Inc., 1990
Aldrich Chemical Company Inc.,
Catalog Handbook of Fine Chemicals, Aldrich Chemical Company, Inc., Milwaukee WI, 1990, 1. [all data]