1,2-Dibutoxyethane
- Formula: C10H22O2
- Molecular weight: 174.2805
- IUPAC Standard InChIKey: GDXHBFHOEYVPED-UHFFFAOYSA-N
- CAS Registry Number: 112-48-1
- Chemical structure:
View 3d structure (requires JavaScript / HTML 5) - Other names: Ethyl glycol dibutyl ether; Ethylene glycol dibutyl ether; Ethylene glycol di-n-butyl ether; Butane, 1,1'-[1,2-ethanediylbis(oxy)]bis-; Ethane, 1,2-dibutoxy-; Dibutyl cellosolve; Dibutylether ethylenglykolu; Dibutyl Oxitol; Glycol dibutyl ether; 1-(2-Butoxyethoxy)butane

Phase change data

Data compiled as indicated in comments:
TRC - Thermodynamics Research Center, NIST Boulder Laboratories, Chris Muzny director
ALS - Hussein Y. Afeefy, Joel F. Liebman, and Stephen E. Stein
AC - William E. Acree, Jr., James S. Chickos
Quantity | Value | Units | Method | Reference | Comment |
---|---|---|---|---|---|
Tboil | 478.95 | K | N/A | Kusano, 1978 | Uncertainty assigned by TRC = 1.5 K; accompanied by decomposition; TRC |
Tboil | 474. | K | N/A | Gist and Mason, 1954 | Uncertainty assigned by TRC = 4. K; TRC |
Tboil | 469. | K | N/A | Berggardh, 1935 | Uncertainty assigned by TRC = 5. K; TRC |
Quantity | Value | Units | Method | Reference | Comment |
ΔvapH° | 58.76 | kJ/mol | N/A | Majer and Svoboda, 1985 | |
ΔvapH° | 58.76 ± 0.08 | kJ/mol | C | Kusano and Wads, 1970 | ALS |
ΔvapH° | 58.8 ± 0.1 | kJ/mol | C | Kusano and Wadso, 1970 | AC |
Enthalpy of vaporization
ΔvapH (kJ/mol) | Temperature (K) | Method | Reference | Comment |
---|---|---|---|---|
55.9 | 371. | A | Stephenson and Malanowski, 1987 | Based on data from 356. to 476. K.; AC |

Kovats' RI, non-polar column, isothermal

Column type | Active phase | Temperature (C) | I | Reference | Comment |
---|---|---|---|---|---|
Packed | SE-30 | 120. | 1160. | García-Raso, Martínez-Castro, et al., 1987 | N2, Supelcoport; Column length: 3. m |
Packed | Apiezon L | 120. | 1117. | Bogoslovsky, Anvaer, et al., 1978 | Celite 545 |
Packed | Apiezon L | 160. | 1130. | Bogoslovsky, Anvaer, et al., 1978 | Celite 545 |

Kovats' RI, polar column, isothermal

Column type | Active phase | Temperature (C) | I | Reference | Comment |
---|---|---|---|---|---|
Capillary | Carbowax 20M | 120. | 1359. | García-Raso, Martínez-Castro, et al., 1987 | N2, Supelcoport; Column length: 25. m; Column diameter: 0.22 mm |

Van Den Dool and Kratz RI, non-polar column, temperature ramp

Column type | Active phase | I | Reference | Comment |
---|---|---|---|---|
Capillary | VF-5MS | 1144. | N/A | 30. m/0.25 mm/0.25 μm, He; Tstart: 60. C; Tend: 270. C |

Normal alkane RI, polar column, custom temperature program

Column type | Active phase | I | Reference | Comment |
---|---|---|---|---|
Capillary | DB-Wax | 1348. | Peng, Yang, et al., 1991 | Program: not specified |

References

Kusano, 1978
Kusano, K.,
Densities, Refractive Indexes, and Normal Boiling Points of 1,2-Disubstituted Ethylene Glycol Derivatives,
J. Chem. Eng. Data, 1978, 23, 141. [all data]
Gist and Mason, 1954
Gist, L.A.; Mason, C.T.,
A New Synthesis of 1,2-dialkoxyethanes,
J. Am. Chem. Soc., 1954, 76, 3728-9. [all data]
Berggardh, 1935
Berggardh, C.,
Preparation of Unsymmetrical Glycol Ethers,
Finska Kemistsamfundets Medd., 1935, 55, 80-4. [all data]
Majer and Svoboda, 1985
Majer, V.; Svoboda, V.,
Enthalpies of Vaporization of Organic Compounds: A Critical Review and Data Compilation, Blackwell Scientific Publications, Oxford, 1985, 300. [all data]
Kusano and Wads, 1970
Kusano, K.; Wads, I.,
Enthalpies of vaporization of organic compounds,
Acta Chem. Scand., 1970, 24, 2037. [all data]
Kusano and Wadso, 1970
Kusano, K.; Wadso, I.,
Enthalpies of vaporization of organic compounds,
Acta Chem. Scand., 1970, 24, 2037-2042. [all data]
Stephenson and Malanowski, 1987
Stephenson, Richard M.; Malanowski, Stanislaw,
Handbook of the Thermodynamics of Organic Compounds, 1987, https://doi.org/10.1007/978-94-009-3173-2
. [all data]
García-Raso, Martínez-Castro, et al., 1987
García-Raso, A.; Martínez-Castro, I.; Páez, M.I.; Sanz, J.; García-Raso, J.; Saura-Calixto, F.,
Gas Chromatographic Behaviour of Carbohydrate Trimethylsilyl Ethers. I. Aldopentoses,
J. Chromatogr., 1987, 398, 9-20, https://doi.org/10.1016/S0021-9673(01)96491-X
. [all data]
Bogoslovsky, Anvaer, et al., 1978
Bogoslovsky, Yu.N.; Anvaer, B.I.; Vigdergauz, M.S.,
Chromatographic constants in gas chromatography (in Russian), Standards Publ. House, Moscow, 1978, 192. [all data]
Peng, Yang, et al., 1991
Peng, C.T.; Yang, Z.C.; Ding, S.F.,
Prediction of rentention idexes. II. Structure-retention index relationship on polar columns,
J. Chromatogr., 1991, 586, 1, 85-112, https://doi.org/10.1016/0021-9673(91)80028-F
. [all data]