10-Undecenal
- Formula: C11H20O
- Molecular weight: 168.2759
- IUPAC Standard InChIKey: OFHHDSQXFXLTKC-UHFFFAOYSA-N
- CAS Registry Number: 112-45-8
- Chemical structure:
View 3d structure (requires JavaScript / HTML 5) - Other names: Undecylenic aldehyde; 10-Undecylenealdehyde; n-Undecylenic aldehyde; 10-Undecenyl aldehyde; Aldehyde C-11, undecylenic; C-11 Aldehyde, undecylenic; Hendecenal; Undecylenaldehyde; 1-Undecen-10-al; 10-Undecen-1-al; Undecylene aldehyde; Undec-10-en-1-al; Undec-10-en-al; 10-Hendecenal; NSC 44900

Kovats' RI, non-polar column, isothermal

Column type | Active phase | Temperature (C) | I | Reference | Comment |
---|---|---|---|---|---|
Capillary | SE-30 | 100. | 1277.2 | Tudor, 1997 | 40. m/0.35 mm/0.35 μm |

Kovats' RI, polar column, isothermal

Column type | Active phase | Temperature (C) | I | Reference | Comment |
---|---|---|---|---|---|
Capillary | Carbowax 20M | 150. | 1675. | Tudor, Moldovan, et al., 1999 | Phase thickness: 0.08 μm |
Capillary | Carbowax 20M | 150. | 1690. | Tudor, Moldovan, et al., 1999 | Phase thickness: 0.45 μm |

Van Den Dool and Kratz RI, non-polar column, temperature ramp

Column type | Active phase | I | Reference | Comment |
---|---|---|---|---|
Capillary | DB-5 | 1279. | Dob, Dahmane, et al., 2006 | 30. m/0.32 mm/0.25 μm, N2, 60. C @ 3. min, 3. K/min, 240. C @ 5. min |
Capillary | HP-5MS | 1297. | Demetzos, Angelopoulou, et al., 2002 | 30. m/0.25 mm/0.25 μm, 50. C @ 5. min, 3. K/min; Tend: 280. C |

Normal alkane RI, non-polar column, temperature ramp

Column type | Active phase | I | Reference | Comment |
---|---|---|---|---|
Capillary | DB-5 | 1313. | Sasaerila, Gries, et al., 1997 | 30. m/0.25 mm/0.32 μm, 10. K/min; Tstart: 50. C; Tend: 200. C |

Normal alkane RI, non-polar column, custom temperature program

Column type | Active phase | I | Reference | Comment |
---|---|---|---|---|
Capillary | VF-5 | 1288. | Shivashankar, Roy, et al., 2012 | 30. m/0.25 mm/0.25 μm, Helium; Program: 50 0C (2 min) 3 0C/min -> 200 0C (3 min) 10 0C/min -> 220 0C (8 min) |
Capillary | VF-5 | 1278. | Shivashankar, Roy, et al., 2012 | 30. m/0.25 mm/0.25 μm, Helium; Program: not specified |
Capillary | SE-30 | 1280. | Vinogradov, 2004 | Program: not specified |

Normal alkane RI, polar column, custom temperature program

Column type | Active phase | I | Reference | Comment |
---|---|---|---|---|
Capillary | Carbowax 20M | 1642. | Vinogradov, 2004 | Program: not specified |

References

Tudor, 1997
Tudor, E.,
Temperature dependence of the retention index for perfumery compounds on a SE-30 glass capillary column. I. Linear equations,
J. Chromatogr. A, 1997, 779, 1-2, 287-297, https://doi.org/10.1016/S0021-9673(97)00453-6
. [all data]
Tudor, Moldovan, et al., 1999
Tudor, E.; Moldovan, D.; Zârna, N.,
Temperature dependence of the retention index for perfumery compounds on two carbowax-20M glass capillary columns with different film thickness. 2,
Rev. Roum. Chim., 1999, 44, 7, 665-675. [all data]
Dob, Dahmane, et al., 2006
Dob, T.; Dahmane, D.; Chelghoum, C.,
Essential oil composition of Juniperus oxycedrus growing in Algeria,
Pharm. Biol., 2006, 44, 1, 1-6, https://doi.org/10.1080/13880200500530922
. [all data]
Demetzos, Angelopoulou, et al., 2002
Demetzos, C.; Angelopoulou, D.; Perdetzoglou, D.,
A comparative study of the essential oils of Cistus salviifolius in several populations of Crete (Greece),
Biochem. Syst. Ecol., 2002, 30, 7, 651-665, https://doi.org/10.1016/S0305-1978(01)00145-4
. [all data]
Sasaerila, Gries, et al., 1997
Sasaerila, Y.; Gries, G.; Khaskin, G.; Gries, R.; Hardi,
Identification of sex pheromone components of nettle caterpillar, Setothosea asigna,
J. Chem. Ecol., 1997, 23, 9, 2187-2196, https://doi.org/10.1023/B:JOEC.0000006438.03728.1a
. [all data]
Shivashankar, Roy, et al., 2012
Shivashankar, S.; Roy, T.K.; Moorthy, P.N.R.,
Headspace solid phase micro extraction and GC/MS analysis of the volatile components in seed and cake of Azadirachta indica A. juss,
Chem. Bull. of Politechnika Univ. Timisoara, Romania, 2012, 57(71), 1, 1-6. [all data]
Vinogradov, 2004
Vinogradov, B.A.,
Production, composition, properties and application of essential oils, 2004, retrieved from http://viness.narod.ru. [all data]