10-Undecen-1-ol
- Formula: C11H22O
- Molecular weight: 170.2918
- IUPAC Standard InChIKey: GIEMHYCMBGELGY-UHFFFAOYSA-N
- CAS Registry Number: 112-43-6
- Chemical structure:
View 3d structure (requires JavaScript / HTML 5) - Other names: ω-Undecenyl alcohol; Undecylenic alcohol; 1-Undecen-11-ol; 10-Undecenol; 10-Undecylen-1-ol; 11-Hydroxy-1-undecene; ω-Undecylenyl alcohol; Undecylenyl alcohol; 10-Undecene-1-ol; Undec-10-enol; undec-10-en-1-ol

Phase change data

Data compiled by: Robert L. Brown and Stephen E. Stein
Reduced pressure boiling point
Tboil (K) | Pressure (bar) | Reference |
---|---|---|
405. | 0.020 | Farchan Laboratories, 1990 |
405.7 | 0.020 | Weast and Grasselli, 1989 |

Normal alkane RI, polar column, temperature ramp

Column type | Active phase | I | Reference | Comment |
---|---|---|---|---|
Capillary | Carbowax 20M | 1664. | Wu, Liou, et al., 1987 | Hydrogen, 1. K/min, 200. C @ 35. min; Column length: 50. m; Column diameter: 0.20 mm; Tstart: 50. C |

References

Farchan Laboratories, 1990
Farchan Laboratories,
Research Chemicals Catalog, Farchan Laboratories, Gainesville, FL, 1990, 91. [all data]
Weast and Grasselli, 1989
CRC Handbook of Data on Organic Compounds, 2nd Editon, Weast,R.C and Grasselli, J.G., ed(s)., CRC Press, Inc., Boca Raton, FL, 1989, 1. [all data]