Cyclohexane, 1-methyl-4-(1-methylethenyl)-, trans-
- Formula: C10H18
- Molecular weight: 138.2499
- IUPAC Standard InChIKey: WPMKLOWQWIDOJN-MGCOHNPYSA-N
- CAS Registry Number: 1124-25-0
- Chemical structure:
View 3d structure (requires JavaScript / HTML 5) - Stereoisomers:
- Other names: p-Menth-8-ene, trans-; trans-p-Menth-8-ene; trans-1-Isopropenyl-4-methylcyclohexane; 8-p-Menthene (trans); 1-Isopropenyl-4-methylcyclohexane, (E)-

Phase change data

Data compiled by: Thermodynamics Research Center, NIST Boulder Laboratories, Chris Muzny director
Quantity | Value | Units | Method | Reference | Comment |
---|---|---|---|---|---|
Tboil | 516.15 | K | N/A | Vogel, 1948 | Uncertainty assigned by TRC = 3. K |
Tboil | 434.2 | K | N/A | Skita and Schneck, 1922 | Uncertainty assigned by TRC = 2. K |

References

Vogel, 1948
Vogel, A.I.,
Physical Properties and Chemical Constitution XX. Aliphatic Alcohols and Acids,
J. Chem. Soc., 1948, 1948, 1814-9. [all data]
Skita and Schneck, 1922
Skita, A.; Schneck, A.,
Stereoismerism in Cyclic Hydrocarbons,
Chem. Ber., 1922, 55, 144-52. [all data]