1-Dodecene
- Formula: C12H24
- Molecular weight: 168.3190
- IUPAC Standard InChIKey: CRSBERNSMYQZNG-UHFFFAOYSA-N
- CAS Registry Number: 112-41-4
- Chemical structure:
View 3d structure (requires JavaScript / HTML 5) - Other names: α-Dodecene; n-Dodec-1-ene; Adacene 12; Dodec-1-ene; α-Dodecylene; Dodecylene α-; Dodecene-1; Neodene 12; NSC 12016

Condensed phase thermochemistry data

Data compiled as indicated in comments:
ALS - Hussein Y. Afeefy, Joel F. Liebman, and Stephen E. Stein
DH - Eugene S. Domalski and Elizabeth D. Hearing
Quantity | Value | Units | Method | Reference | Comment |
---|---|---|---|---|---|
ΔfH°liquid | -226.2 ± 2.1 | kJ/mol | Ccr | Stridh, 1976 | ALS |
Quantity | Value | Units | Method | Reference | Comment |
ΔcH°liquid | -7925.9 ± 1.3 | kJ/mol | Ccr | Stridh, 1976 | Corresponding ΔfHºliquid = -226.2 kJ/mol (simple calculation by NIST; no Washburn corrections); ALS |
Quantity | Value | Units | Method | Reference | Comment |
S°liquid | 484.80 | J/mol*K | N/A | McCullough, Finke, et al., 1957 | Does not include S0.; DH |
Constant pressure heat capacity of liquid
Cp,liquid (J/mol*K) | Temperature (K) | Reference | Comment |
---|---|---|---|
360.66 | 298.15 | McCullough, Finke, et al., 1957 | T = 11 to 360 K.; DH |

Phase change data

Data compiled as indicated in comments:
BS - Robert L. Brown and Stephen E. Stein
TRC - Thermodynamics Research Center, NIST Boulder Laboratories, Chris Muzny director
ALS - Hussein Y. Afeefy, Joel F. Liebman, and Stephen E. Stein
AC - William E. Acree, Jr., James S. Chickos
CAL - James S. Chickos, William E. Acree, Jr., Joel F. Liebman, Students of Chem 202 (Introduction to the Literature of Chemistry), University of Missouri -- St. Louis
DH - Eugene S. Domalski and Elizabeth D. Hearing
Quantity | Value | Units | Method | Reference | Comment |
---|---|---|---|---|---|
Tboil | 486.2 ± 0.6 | K | AVG | N/A | Average of 6 values; Individual data points |
Quantity | Value | Units | Method | Reference | Comment |
Tfus | 238. ± 1. | K | AVG | N/A | Average of 10 values; Individual data points |
Quantity | Value | Units | Method | Reference | Comment |
Ttriple | 237.93 | K | N/A | McCullough, Finke, et al., 1957, 2 | Crystal phase 1 phase; Uncertainty assigned by TRC = 0.05 K; TRC |
Quantity | Value | Units | Method | Reference | Comment |
Tc | 658. ± 2. | K | N/A | Tsonopoulos and Ambrose, 1996 | |
Quantity | Value | Units | Method | Reference | Comment |
Pc | 19.3 ± 2.0 | bar | N/A | Tsonopoulos and Ambrose, 1996 | |
Quantity | Value | Units | Method | Reference | Comment |
ΔvapH° | 60.78 | kJ/mol | N/A | Majer and Svoboda, 1985 | |
ΔvapH° | 60.78 ± 0.20 | kJ/mol | C | Mansson, Sellers, et al., 1977 | ALS |
ΔvapH° | 60.78 ± 0.29 | kJ/mol | V | Stridh, 1976 | ALS |
ΔvapH° | 60.8 ± 0.3 | kJ/mol | C | Stridh, 1976 | See also Månsson, Sellers, et al., 1977.; AC |
ΔvapH° | 60.3 | kJ/mol | N/A | Reid, 1972 | AC |
Enthalpy of vaporization
ΔvapH (kJ/mol) | Temperature (K) | Method | Reference | Comment |
---|---|---|---|---|
51.1 | 411. | A | Stephenson and Malanowski, 1987 | Based on data from 396. to 493. K. See also Forziati, Camin, et al., 1950.; AC |
Antoine Equation Parameters
log10(P) = A − (B / (T + C))
P = vapor pressure (bar)
T = temperature (K)
View plot Requires a JavaScript / HTML 5 canvas capable browser.
Temperature (K) | A | B | C | Reference |
---|---|---|---|---|
396.8 to 487.62 | 4.10012 | 1619.862 | -90.879 | Forziati, Camin, et al., 1950, 2 |
Enthalpy of fusion
ΔfusH (kJ/mol) | Temperature (K) | Reference | Comment |
---|---|---|---|
19.87 | 237.9 | Domalski and Hearing, 1996 | AC |
Entropy of fusion
ΔfusS (J/mol*K) | Temperature (K) | Reference | Comment |
---|---|---|---|
21.38 | 212.9 | Domalski and Hearing, 1996 | CAL |
83.54 | 237.9 |
Enthalpy of phase transition
ΔHtrs (kJ/mol) | Temperature (K) | Initial Phase | Final Phase | Reference | Comment |
---|---|---|---|---|---|
4.552 | 212.9 | crystaline, II | crystaline, I | McCullough, Finke, et al., 1957 | DH |
19.907 | 237.93 | crystaline, I | liquid | McCullough, Finke, et al., 1957 | DH |
Entropy of phase transition
ΔStrs (J/mol*K) | Temperature (K) | Initial Phase | Final Phase | Reference | Comment |
---|---|---|---|---|---|
21.38 | 212.9 | crystaline, II | crystaline, I | McCullough, Finke, et al., 1957 | DH |
83.67 | 237.93 | crystaline, I | liquid | McCullough, Finke, et al., 1957 | DH |

Gas phase thermochemistry data

Data compiled by: Hussein Y. Afeefy, Joel F. Liebman, and Stephen E. Stein
Quantity | Value | Units | Method | Reference | Comment |
---|---|---|---|---|---|
ΔfH°gas | -39.53 ± 0.50 | kcal/mol | Ccr | Stridh, 1976 | |
ΔfH°gas | -39.49 | kcal/mol | Chyd | Bretschneider and Rogers, 1970 |

Reaction thermochemistry data

Data compiled by: Hussein Y. Afeefy, Joel F. Liebman, and Stephen E. Stein
Individual Reactions
By formula: C12H24 + H2 = C12H26
Quantity | Value | Units | Method | Reference | Comment |
---|---|---|---|---|---|
ΔrH° | -29.98 ± 0.35 | kcal/mol | Chyd | Rogers and Skanupong, 1974 | liquid phase; solvent: Hexane |
ΔrH° | 30.05 ± 0.50 | kcal/mol | Chyd | Bretschneider and Rogers, 1970 | liquid phase; solvent: glacial acetic acid |

Van Den Dool and Kratz RI, polar column, custom temperature program

Data compiled by: NIST Mass Spectrometry Data Center, William E. Wallace, director

Column type CapillaryCapillary
Active phase DB-WaxDB-Wax
Column length (m) 30.30.
Carrier gas HeHe
Substrate
Column diameter (mm) 0.320.32
Phase thickness (μm) 0.50.5
Program 50C => 6C/min => 70C => 4C/min => 150C => 10C/min => 250C50C => 6C/min => 70C => 4C/min => 150C => 10C/min => 250C
I 1236.1236.
ReferencePennarun, Prost, et al., 2003Pennarun, Prost, et al., 2002
Comment MSDC-RI MSDC-RI

Kovats' RI, non-polar column, custom temperature program

Data compiled by: NIST Mass Spectrometry Data Center, William E. Wallace, director

Column type Capillary
Active phase Petrocol DH-100
Column length (m) 100.
Carrier gas He
Substrate
Column diameter (mm) 0.2
Phase thickness (μm)
Program 5C(10min) => 5C/min => 50C(48min) => 1.5C/min => 195C(91min)
I 1192.2
ReferenceHaagen-Smit Laboratory, 1997
Comment MSDC-RI

Lee's RI, non-polar column, temperature ramp

Data compiled by: NIST Mass Spectrometry Data Center, William E. Wallace, director

Column type Capillary
Active phase DB-5
Column length (m) 30.
Carrier gas He
Substrate
Column diameter (mm) 0.32
Phase thickness (μm) 0.25
Tstart (C) 40.
Tend (C) 285.
Heat rate (K/min) 8.
Initial hold (min) 3.
Final hold (min) 29.5
I 199.3
ReferenceDonnelly, Abdel-Hamid, et al., 1993
Comment MSDC-RI

Normal alkane RI, non-polar column, custom temperature program

Data compiled by: NIST Mass Spectrometry Data Center, William E. Wallace, director

Column type CapillaryCapillaryCapillaryCapillaryCapillary
Active phase HP-5Polydimethyl siloxaneDB-5 MSHP-5OV-1, SE-30, Methyl silicone, SP-2100, OV-101, DB-1, etc.
Column length (m) 50. 30.50.50.
Carrier gas Helium HeliumHeHydrogen
Substrate
Column diameter (mm) 0.32 0.250.320.32
Phase thickness (μm) 1.05 1.00.52
Program 40 0C (10 min) 5 0C/min -> 200 0C 15 0C/min -> 250 0C (10 min)not specifiednot specified35 0C 10 0C/min -> 200 0C (20 min) 5 0C/min -> 230 0C (50 min)not specified
I 1199.1183.1185.1192.1189.
ReferenceVentanas, Estevez, et al., 2008Junkes, Castanho, et al., 2003Luo and Agnew, 2001Timón, Ventanas, et al., 1998Waggott and Davies, 1984
Comment MSDC-RI MSDC-RI MSDC-RI MSDC-RI MSDC-RI
Column type PackedPacked
Active phase SE-30Squalane
Column length (m) 6.13.0
Carrier gas N2N2
Substrate Chromosorb WEmbacel
Column diameter (mm)
Phase thickness (μm)
Program 50C910min) => 20C/min => 90(6min) => 10C/min => 150C(hold)25C(5min) => 2C/min => 35 => 4C/min => 95C(hold)
I 1190.1182.
ReferenceRobinson and Odell, 1971Robinson and Odell, 1971
Comment MSDC-RI MSDC-RI

Kovats' RI, non-polar column, temperature ramp

Data compiled by: NIST Mass Spectrometry Data Center, William E. Wallace, director

Column type Capillary
Active phase OV-101
Column length (m) 110.
Carrier gas He
Substrate
Column diameter (mm) 0.25
Phase thickness (μm) 0.20
Tstart (C) 35.
Tend (C) 200.
Heat rate (K/min) 1.
Initial hold (min)
Final hold (min)
I 1189.
ReferenceHayes and Pitzer, 1982
Comment MSDC-RI

References

Stridh, 1976
Stridh, G.,
Enthalpies of formation of 1-dodecene and 1-hexadecene and the CH2-increment in the 1-alkene series,
J. Chem. Thermodyn., 1976, 8, 895-899. [all data]
McCullough, Finke, et al., 1957
McCullough, J.P.; Finke, H.L.; Gross, M.E.; Messerly, J.F.; Waddington, G.,
Low temperature calorimetric studies of seven 1-olefins: effect of orientational disorder in the solid state,
J. Phys. Chem., 1957, 61, 289-301. [all data]
McCullough, Finke, et al., 1957, 2
McCullough, J.P.; Finke, H.L.; Gross, M.E.; Messerly, J.F.; Waddington, G.,
Low temperature calorimetric studies of seven 1-olefins: effect of orientational disorder in the solid state,
J. Phys. Chem., 1957, 61, 289. [all data]
Tsonopoulos and Ambrose, 1996
Tsonopoulos, C.; Ambrose, D.,
Vapor-Liquid Critical Properties of Elements and Compounds. 6. Unsaturated Aliphatic Hydrocarbons,
J. Chem. Eng. Data, 1996, 41, 645-656. [all data]
Majer and Svoboda, 1985
Majer, V.; Svoboda, V.,
Enthalpies of Vaporization of Organic Compounds: A Critical Review and Data Compilation, Blackwell Scientific Publications, Oxford, 1985, 300. [all data]
Mansson, Sellers, et al., 1977
Mansson, M.; Sellers, P.; Stridh, G.; Sunner, S.,
Enthalpies of vaporization of some 1-substituted n-alkanes,
J. Chem. Thermodyn., 1977, 9, 91. [all data]
Månsson, Sellers, et al., 1977
Månsson, M.; Sellers, P.; Stridh, G.; Sunner, S.,
Enthalpies of vaporization of some 1-substituted n-alkanes,
The Journal of Chemical Thermodynamics, 1977, 9, 1, 91-97, https://doi.org/10.1016/0021-9614(77)90202-6
. [all data]
Reid, 1972
Reid, Robert C.,
Handbook on vapor pressure and heats of vaporization of hydrocarbons and related compounds, R. C. Wilhort and B. J. Zwolinski, Texas A Research Foundation. College Station, Texas(1971). 329 pages.$10.00,
AIChE J., 1972, 18, 6, 1278-1278, https://doi.org/10.1002/aic.690180637
. [all data]
Stephenson and Malanowski, 1987
Stephenson, Richard M.; Malanowski, Stanislaw,
Handbook of the Thermodynamics of Organic Compounds, 1987, https://doi.org/10.1007/978-94-009-3173-2
. [all data]
Forziati, Camin, et al., 1950
Forziati, A.F.; Camin, D.L.; Rossini, F.D.,
Density, refractive index, boiling point, and vapor pressure of eight monoolefin (1-alkene), six pentadiene, and two cyclomonoolefin hydrocarbons,
J. RES. NATL. BUR. STAN., 1950, 45, 5, 406, https://doi.org/10.6028/jres.045.044
. [all data]
Forziati, Camin, et al., 1950, 2
Forziati, a.F.; Camin, D.L.; Rossini, F.D.,
Density, refractive index, boiling point, and vapor pressure of eight monoolefin (1-alkene), six pentadiene, and two cyclomonoolefin hydrocarbons,
J. Res. NBS, 1950, 45, 406-410. [all data]
Domalski and Hearing, 1996
Domalski, Eugene S.; Hearing, Elizabeth D.,
Heat Capacities and Entropies of Organic Compounds in the Condensed Phase. Volume III,
J. Phys. Chem. Ref. Data, 1996, 25, 1, 1, https://doi.org/10.1063/1.555985
. [all data]