Phenol, 4-ethyl-3-methyl-
- Formula: C9H12O
- Molecular weight: 136.1910
- IUPAC Standard InChIKey: BUQNXFUMFXFRKC-UHFFFAOYSA-N
- CAS Registry Number: 1123-94-0
- Chemical structure:
View 3d structure (requires JavaScript / HTML 5) - Other names: m-Cresol, 4-ethyl-; 3-Methyl-4-ethylphenol; 4-Ethyl-m-cresol; 4-Ethyl-3-methylphenol

Phase change data

Data compiled by: Thermodynamics Research Center, NIST Boulder Laboratories, Chris Muzny director
Quantity | Value | Units | Method | Reference | Comment |
---|---|---|---|---|---|
Tboil | 502.15 | K | N/A | Karr, Estep, et al., 1961 | Uncertainty assigned by TRC = 3. K |
Tboil | 502.15 | K | N/A | Karr, 1957 | Uncertainty assigned by TRC = 3. K |
Tboil | 505.65 | K | N/A | Niederl, Niederl, et al., 1937 | Uncertainty assigned by TRC = 3. K |
Tboil | 502.15 | K | N/A | Von Auwers and Mauss, 1928 | Uncertainty assigned by TRC = 3. K |
Quantity | Value | Units | Method | Reference | Comment |
Tfus | 299.15 | K | N/A | Karr, 1957 | Uncertainty assigned by TRC = 10. K |
Tfus | 318.15 | K | N/A | Baddeley, 1944 | Uncertainty assigned by TRC = 4. K |

References

Karr, Estep, et al., 1961
Karr, C.; Estep, P.A.; Chang, T.-C.L.; Comberiati, H.R.,
, U. S. Bur. Mines, Bull. 591, 1961. [all data]
Karr, 1957
Karr, C.,
, U. S. Bur. Mines, Inform. Circ. IC 7802, 1957. [all data]
Niederl, Niederl, et al., 1937
Niederl, J.B.; Niederl, V.; Shapiro, S.; McGreal, M.E.,
J. Am. Chem. Soc., 1937, 59, 1113. [all data]
Von Auwers and Mauss, 1928
Von Auwers, K.; Mauss, W.,
Justus Liebigs Ann. Chem., 1928, 460, 240. [all data]
Baddeley, 1944
Baddeley, G.,
J. Chem. Soc., 1944, 1944, 330. [all data]