1-Propanone, 1-cyclohexyl-
- Formula: C9H16O
- Molecular weight: 140.2227
- IUPAC Standard InChIKey: AMHOPTNGSNYSBL-UHFFFAOYSA-N
- CAS Registry Number: 1123-86-0
- Chemical structure:
View 3d structure (requires JavaScript / HTML 5) - Other names: Ethyl cyclohexyl ketone; Ketone, cyclohexyl ethyl; 1-Cyclohexyl-1-propanone; 1-cyclohexylpropan-1-one

Condensed phase thermochemistry data

Data compiled by: Hussein Y. Afeefy, Joel F. Liebman, and Stephen E. Stein
Quantity | Value | Units | Method | Reference | Comment |
---|---|---|---|---|---|
ΔcH°liquid | -5440.0 | kJ/mol | Ccb | Zubova, 1901 | Corresponding ΔfHºliquid = -388. kJ/mol (simple calculation by NIST; no Washburn corrections) |

Phase change data

Data compiled by: Robert L. Brown and Stephen E. Stein
Quantity | Value | Units | Method | Reference | Comment |
---|---|---|---|---|---|
Tboil | 469.2 | K | N/A | Weast and Grasselli, 1989 |
Reduced pressure boiling point
Tboil (K) | Pressure (bar) | Reference |
---|---|---|
361.7 | 0.025 | Weast and Grasselli, 1989 |

References

Zubova, 1901
Zubova, P.,
Data about heat of combustion of compound cycle structure,
Zh. Fiz. Khim., 1901, 33, 708-722. [all data]
Weast and Grasselli, 1989
CRC Handbook of Data on Organic Compounds, 2nd Editon, Weast,R.C and Grasselli, J.G., ed(s)., CRC Press, Inc., Boca Raton, FL, 1989, 1. [all data]