Undecanoic acid
- Formula: C11H22O2
- Molecular weight: 186.2912
- IUPAC Standard InChIKey: ZDPHROOEEOARMN-UHFFFAOYSA-N
- CAS Registry Number: 112-37-8
- Chemical structure:
View 3d structure (requires JavaScript / HTML 5) - Other names: n-Undecanoic acid; n-Undecoic acid; n-Undecylic acid; Hendecanoic acid; Undecylic acid; 1-Decanecarboxylic acid

Condensed phase thermochemistry data

Data compiled as indicated in comments:
ALS - Hussein Y. Afeefy, Joel F. Liebman, and Stephen E. Stein
DH - Eugene S. Domalski and Elizabeth D. Hearing
Quantity | Value | Units | Method | Reference | Comment |
---|---|---|---|---|---|
ΔcH°liquid | -6736.5 ± 0.9 | kJ/mol | Ccb | Adriaanse, Dekker, et al., 1965 | Hfusion=25.8 kJ/mol; Corresponding ΔfHºliquid = -736.2 kJ/mol (simple calculation by NIST; no Washburn corrections); ALS |
Constant pressure heat capacity of solid
Cp,solid (J/mol*K) | Temperature (K) | Reference | Comment |
---|---|---|---|
768.8 | 298.15 | Schaake, van Miltenburg, et al., 1982 | T = 80 to 330 K.; DH |
415.1 | 293. | Garner and Randall, 1924 | crystaline, I phase; T = 0 to 66°C. Mean value 14 to 21°C.; DH |

Phase change data

Data compiled as indicated in comments:
TRC - Thermodynamics Research Center, NIST Boulder Laboratories, Chris Muzny director
BS - Robert L. Brown and Stephen E. Stein
AC - William E. Acree, Jr., James S. Chickos
ALS - Hussein Y. Afeefy, Joel F. Liebman, and Stephen E. Stein
CAL - James S. Chickos, William E. Acree, Jr., Joel F. Liebman, Students of Chem 202 (Introduction to the Literature of Chemistry), University of Missouri -- St. Louis
DH - Eugene S. Domalski and Elizabeth D. Hearing
Quantity | Value | Units | Method | Reference | Comment |
---|---|---|---|---|---|
Tboil | 438.15 | K | N/A | Komori and Agawa, 1954 | TRC |
Tboil | 553.15 | K | N/A | Langlais and Goby, 1924 | Uncertainty assigned by TRC = 5. K; TRC |
Quantity | Value | Units | Method | Reference | Comment |
Tfus | 301.65 | K | N/A | Gaikwad and Subrahmanyam, 1985 | Uncertainty assigned by TRC = 0.4 K; TRC |
Tfus | 301.9 | K | N/A | Adriaanse, Dekker, et al., 1964 | Uncertainty assigned by TRC = 0.05 K; TRC |
Tfus | 302. | K | N/A | Timmermans, 1935 | Uncertainty assigned by TRC = 1.5 K; TRC |
Tfus | 301.4 | K | N/A | Garner and Randall, 1924, 2 | Crystal phase 1 phase; Uncertainty assigned by TRC = 0.2 K; TRC |
Tfus | 301.2 | K | N/A | Krafft, 1882 | Uncertainty assigned by TRC = 3. K; TRC |
Quantity | Value | Units | Method | Reference | Comment |
Ttriple | 301.63 | K | N/A | Schaake, van Miltenburg, et al., 1982, 2 | Crystal phase 1 phase; Uncertainty assigned by TRC = 0.02 K; TRC |
Quantity | Value | Units | Method | Reference | Comment |
Tc | 731.26 | K | N/A | D'Souza and Teja, 1987 | Uncertainty assigned by TRC = 3. K; Ambrose's procedure; TRC |
Quantity | Value | Units | Method | Reference | Comment |
Pc | 20.0404 | bar | N/A | D'Souza and Teja, 1987 | Uncertainty assigned by TRC = 0.90 bar; Ambrose's procedure; TRC |
Quantity | Value | Units | Method | Reference | Comment |
ΔsubH° | 121. ± 1. | kJ/mol | V | Baccanari, Novinski, et al., 1968 | ALS |
ΔsubH° | 121.3 ± 1.3 | kJ/mol | ME | Baccanari, Novinski, et al., 1968 | Based on data from 303. to 308. K. See also Cox and Pilcher, 1970.; AC |
Reduced pressure boiling point
Tboil (K) | Pressure (bar) | Reference | Comment |
---|---|---|---|
501.2 | 0.213 | Aldrich Chemical Company Inc., 1990 | BS |
437.2 | 0.020 | Weast and Grasselli, 1989 | BS |
Enthalpy of vaporization
ΔvapH (kJ/mol) | Temperature (K) | Method | Reference | Comment |
---|---|---|---|---|
81.3 | 408. | A | Stephenson and Malanowski, 1987 | Based on data from 393. to 557. K.; AC |
90.7 ± 2.0 | 323. | ME,TE | de Kruif, Schaake, et al., 1982 | Based on data from 310. to 332. K.; AC |
97.9 ± 6.3 | 305. | N/A | Baccanari, Novinski, et al., 1968 | Based on data from 303. to 308. K.; AC |
Antoine Equation Parameters
log10(P) = A − (B / (T + C))
P = vapor pressure (bar)
T = temperature (K)
View plot Requires a JavaScript / HTML 5 canvas capable browser.
Temperature (K) | A | B | C | Reference | Comment |
---|---|---|---|---|---|
374.6 to 563. | 5.07042 | 2640.792 | -42.034 | Stull, 1947 | Coefficents calculated by NIST from author's data. |
Enthalpy of fusion
ΔfusH (kJ/mol) | Temperature (K) | Reference | Comment |
---|---|---|---|
25.98 | 301.6 | Domalski and Hearing, 1996 | AC |
Entropy of fusion
ΔfusS (J/mol*K) | Temperature (K) | Reference | Comment |
---|---|---|---|
28.03 | 290. | Domalski and Hearing, 1996 | CAL |
86.15 | 301.6 |
Enthalpy of phase transition
ΔHtrs (kJ/mol) | Temperature (K) | Initial Phase | Final Phase | Reference | Comment |
---|---|---|---|---|---|
8.150 | 290.3 | crystaline, II | crystaline, I | Schaake, van Miltenburg, et al., 1982 | DH |
25.980 | 301.63 | crystaline, I | liquid | Schaake, van Miltenburg, et al., 1982 | DH |
7.700 | 290. | crystaline, II | crystaline, I | Garner and Randall, 1924 | DH |
25.100 | 301.4 | crystaline, I | liquid | Garner and Randall, 1924 | DH |
Entropy of phase transition
ΔStrs (J/mol*K) | Temperature (K) | Initial Phase | Final Phase | Reference | Comment |
---|---|---|---|---|---|
28.07 | 290.3 | crystaline, II | crystaline, I | Schaake, van Miltenburg, et al., 1982 | DH |
86.13 | 301.63 | crystaline, I | liquid | Schaake, van Miltenburg, et al., 1982 | DH |
26.6 | 290. | crystaline, II | crystaline, I | Garner and Randall, 1924 | DH |
83.3 | 301.4 | crystaline, I | liquid | Garner and Randall, 1924 | DH |

Normal alkane RI, non-polar column, temperature ramp

Data compiled by: NIST Mass Spectrometry Data Center, William E. Wallace, director

Column type CapillaryCapillaryCapillaryCapillaryCapillary
Active phase HP-5 MSDB-5PE-5Polymethylsiloxane, (PMS-20000)Optima-1
Column length (m) 30.30.50.25.25.
Carrier gas HeliumN2HeHeHe
Substrate
Column diameter (mm) 0.250.250.320.200.20
Phase thickness (μm) 0.250.250.25 0.25
Tstart (C) 70.70.100.50.50.
Tend (C) 290.230.280.250.250.
Heat rate (K/min) 5.2.3.3.3.
Initial hold (min)  2.1.3.3.
Final hold (min) 10.20.
I 1465.1490.1482.1493.1469.
ReferenceRadulovic, Blagojevic, et al., 2010Choi, 2006Pandey-Rai S., Mallavarapu G.R., et al., 2006Dohou, Yamni, et al., 2005de Beck, Bessière, et al., 2000
Comment MSDC-RI MSDC-RI MSDC-RI MSDC-RI MSDC-RI
Column type Capillary
Active phase Ultra-1
Column length (m) 25.
Carrier gas He
Substrate
Column diameter (mm) 0.32
Phase thickness (μm) 0.25
Tstart (C) 80.
Tend (C) 260.
Heat rate (K/min) 3.
Initial hold (min)
Final hold (min)
I 1474.
ReferenceOkumura, 1991
Comment MSDC-RI

Van Den Dool and Kratz RI, polar column, custom temperature program

Data compiled by: NIST Mass Spectrometry Data Center, William E. Wallace, director

Column type Capillary
Active phase DB-Wax
Column length (m) 60.
Carrier gas He
Substrate
Column diameter (mm) 0.25
Phase thickness (μm) 0.25
Program 35C(0.7min) => 20C/min => 70C => 4C/min => 240C
I 2365.
ReferenceFerrari, Lablanquie, et al., 2004
Comment MSDC-RI

References

Adriaanse, Dekker, et al., 1965
Adriaanse, N.; Dekker, H.; Coops, J.,
Heats of combustion of normal saturated fatty acids and their methyl esters,
Rec. Trav. Chim. Pays/Bas, 1965, 84, 393-407. [all data]
Schaake, van Miltenburg, et al., 1982
Schaake, R.C.F.; van Miltenburg, J.C.; De Kruif, C.G.,
Thermodynamic properties of the normal alkanoic acids. I. Molar heat capacities of seven odd-numbered normal alkanoic acids,
J. Chem. Thermodynam., 1982, 14, 763-769. [all data]
Garner and Randall, 1924
Garner, W.E.; Randall, F.C.,
Alternation in the heats of crystallization of the normal monobasic fatty acids. Part I.,
J. Chem. Soc., 1924, 125, 881-896. [all data]
Komori and Agawa, 1954
Komori, S.; Agawa, T.,
Liver Oil of Laemonema Morosum Matsubara II. Studies on Docosenol Fractions,
Nippon Kagaku Zasshi, 1954, 75, 1051. [all data]
Langlais and Goby, 1924
Langlais, P.; Goby,
C. R. Hebd. Seances Acad. Sci., 1924, 179, 173. [all data]
Gaikwad and Subrahmanyam, 1985
Gaikwad, B.R.; Subrahmanyam, V.V.,
Melting behavior of fatty alcohols and their binary blends.,
J. Indian Chem. Soc., 1985, 62, 513. [all data]
Adriaanse, Dekker, et al., 1964
Adriaanse, N.; Dekker, H.; Coops, J.,
Some Physical Constants of Normal, Saturated Fatty Acids and Their Methyl Esters,
Recl. Trav. Chim. Pays-Bas, 1964, 83, 557. [all data]
Timmermans, 1935
Timmermans, J.,
Researches in Stoichiometry. I. The Heat of Fusion of Organic Compounds.,
Bull. Soc. Chim. Belg., 1935, 44, 17-40. [all data]
Garner and Randall, 1924, 2
Garner, W.E.; Randall, F.C.,
Alternation in the Heats of Crystallization of the Normal Monobasic Fatty Acids. Part I.,
J. Chem. Soc., 1924, 125, 881-96. [all data]
Krafft, 1882
Krafft, F.,
On Nineteen Higher Normal Paraffins and a Simple Volume Law for Liquids that form Drops I.,
Ber. Dtsch. Chem. Ges., 1882, 15, 1687-711. [all data]
Schaake, van Miltenburg, et al., 1982, 2
Schaake, R.C.F.; van Miltenburg, J.C.; De Kruif, C.G.,
Thermodynamic properties of the normal alkanoic acids. I. Molar heat capacities of seven odd-numbered normal alkanoic acids.,
J. Chem. Thermodyn., 1982, 14, 763. [all data]
D'Souza and Teja, 1987
D'Souza, R.; Teja, A.S.,
The prediction of the vapor pressures of carboxylic acids,
Chem. Eng. Commun., 1987, 61, 13. [all data]
Baccanari, Novinski, et al., 1968
Baccanari, D.P.; Novinski, J.A.; Pan, Y.; Yevitz, M.M.; Swain, H.A., Jr.,
Heats of sublimation and vaporization at 25° of long chain fatty acids and methyl esters,
Trans. Faraday Soc., 1968, 64, 1201. [all data]
Cox and Pilcher, 1970
Cox, J.D.; Pilcher, G.,
Thermochemistry of Organic and Organometallic Compounds, Academic Press Inc., London, 1970, 643. [all data]
Aldrich Chemical Company Inc., 1990
Aldrich Chemical Company Inc.,
Catalog Handbook of Fine Chemicals, Aldrich Chemical Company, Inc., Milwaukee WI, 1990, 1. [all data]
Weast and Grasselli, 1989
CRC Handbook of Data on Organic Compounds, 2nd Editon, Weast,R.C and Grasselli, J.G., ed(s)., CRC Press, Inc., Boca Raton, FL, 1989, 1. [all data]
Stephenson and Malanowski, 1987
Stephenson, Richard M.; Malanowski, Stanislaw,
Handbook of the Thermodynamics of Organic Compounds, 1987, https://doi.org/10.1007/978-94-009-3173-2
. [all data]
de Kruif, Schaake, et al., 1982
de Kruif, C.G.; Schaake, R.C.F.; van Miltenburg, J.C.; van der Klauw, K.; Blok, J.G.,
Thermodynamic properties of the normal alkanoic acids III. Enthalpies of vaporization and vapour pressures of 13 normal alkanoic acids,
The Journal of Chemical Thermodynamics, 1982, 14, 8, 791-798, https://doi.org/10.1016/0021-9614(82)90176-8
. [all data]
Stull, 1947
Stull, Daniel R.,
Vapor Pressure of Pure Substances. Organic and Inorganic Compounds,
Ind. Eng. Chem., 1947, 39, 4, 517-540, https://doi.org/10.1021/ie50448a022
. [all data]
Domalski and Hearing, 1996
Domalski, Eugene S.; Hearing, Elizabeth D.,
Heat Capacities and Entropies of Organic Compounds in the Condensed Phase. Volume III,
J. Phys. Chem. Ref. Data, 1996, 25, 1, 1, https://doi.org/10.1063/1.555985
. [all data]