Ethanol, 2-[2-(2-methoxyethoxy)ethoxy]-
- Formula: C7H16O4
- Molecular weight: 164.1995
- IUPAC Standard InChIKey: JLGLQAWTXXGVEM-UHFFFAOYSA-N
- CAS Registry Number: 112-35-6
- Chemical structure:
View 3d structure (requires JavaScript / HTML 5) - Other names: Dowanol TMAT; Methoxytriethylene glycol; Methoxytriglycol; Methyltrioxitol; Triethylene glycol monomethyl ether; Triglycol monomethyl ether; 2-[2-(2-Methoxyethoxy)ethoxy]ethanol; Triethylene glycol methyl ether; Poly-Solv TM; 3,6,9-Trioxa-1-decanol; 3,6,9-Trioxadecanol; NSC 97395

Phase change data

Data compiled as indicated in comments:
BS - Robert L. Brown and Stephen E. Stein
TRC - Thermodynamics Research Center, NIST Boulder Laboratories, Chris Muzny director
Quantity | Value | Units | Method | Reference | Comment |
---|---|---|---|---|---|
Tboil | 522.2 | K | N/A | Weast and Grasselli, 1989 | BS |
Tboil | 518.4 | K | N/A | Lecat, 1947 | Uncertainty assigned by TRC = 0.6 K; TRC |
Tboil | 521. | K | N/A | Davidson, 1926 | Uncertainty assigned by TRC = 3. K; TRC |
Reduced pressure boiling point
Tboil (K) | Pressure (bar) | Reference | Comment |
---|---|---|---|
395.2 | 0.013 | Aldrich Chemical Company Inc., 1990 | BS |

Kovats' RI, non-polar column, isothermal

Column type | Active phase | Temperature (C) | I | Reference | Comment |
---|---|---|---|---|---|
Packed | Apiezon L | 170. | 1150. | Singliar and Dykyj, 1969 |

Van Den Dool and Kratz RI, non-polar column, temperature ramp

Column type | Active phase | I | Reference | Comment |
---|---|---|---|---|
Capillary | Ultra-2 | 1219. | Poskrobko, Linkiewicz, et al., 1994 | 25. m/0.32 mm/0.52 μm, H2, 8. K/min; Tstart: 50. C; Tend: 310. C |

Van Den Dool and Kratz RI, non-polar column, custom temperature program

Column type | Active phase | I | Reference | Comment |
---|---|---|---|---|
Capillary | VF-5MS | 1225.6 | Zheng and White, 2008 | 30. m/0.25 mm/0.25 μm, He; Program: not specified |

Normal alkane RI, polar column, custom temperature program

Column type | Active phase | I | Reference | Comment |
---|---|---|---|---|
Capillary | DB-Wax | 1963. | Peng, Yang, et al., 1991 | Program: not specified |

References

Weast and Grasselli, 1989
CRC Handbook of Data on Organic Compounds, 2nd Editon, Weast,R.C and Grasselli, J.G., ed(s)., CRC Press, Inc., Boca Raton, FL, 1989, 1. [all data]
Lecat, 1947
Lecat, M.,
Some azeotropes of which one constituant is heterocyclic nitrogen,
Ann. Soc. Sci. Bruxelles, Ser. 1, 1947, 61, 73. [all data]
Davidson, 1926
Davidson, J.G.,
The glycol ethers and their use in the lacquer industry,
Ind. Eng. Chem., 1926, 18, 669. [all data]
Aldrich Chemical Company Inc., 1990
Aldrich Chemical Company Inc.,
Catalog Handbook of Fine Chemicals, Aldrich Chemical Company, Inc., Milwaukee WI, 1990, 1. [all data]
Singliar and Dykyj, 1969
Singliar, M.; Dykyj, J.,
Gas chromatography of glycol ethers,
Collect. Czech. Chem. Commun., 1969, 34, 3, 767-775, https://doi.org/10.1135/cccc19690767
. [all data]
Poskrobko, Linkiewicz, et al., 1994
Poskrobko, J.; Linkiewicz, M.; Jaworski, M.,
Analysis of high-boiling ethoxylates of methyl, ethyl and butyl alcohols, with the use of gas chromatography,
Chem. Anal. (Warsaw), 1994, 39, 2, 153-159. [all data]
Zheng and White, 2008
Zheng, Y.; White, E.,
Retention Data. NIST Mass Spectrometry Data Center., NIST Mass Spectrometry Data Center, 2008. [all data]
Peng, Yang, et al., 1991
Peng, C.T.; Yang, Z.C.; Ding, S.F.,
Prediction of rentention idexes. II. Structure-retention index relationship on polar columns,
J. Chromatogr., 1991, 586, 1, 85-112, https://doi.org/10.1016/0021-9673(91)80028-F
. [all data]