Ethanol, 2-(2-butoxyethoxy)-
- Formula: C8H18O3
- Molecular weight: 162.2267
- IUPAC Standard InChIKey: OAYXUHPQHDHDDZ-UHFFFAOYSA-N
- CAS Registry Number: 112-34-5
- Chemical structure:
View 3d structure (requires JavaScript / HTML 5) - Other names: Butoxyethoxyethanol; Butyl diglycol; Butyl digol; Butyl dioxitol; Butyl Carbitol; BuCb; Diethylene glycol butyl ether; Diethylene glycol monobutyl ether; Diethylene glycol n-butyl ether; Diglycol monobutyl ether; Dowanol DB; Ethanol, 2,2'-oxybis-, monobutyl ether; O-Butyl diethylene glycol; Poly-Solv DB; 2-(2-Butoxyethoxy)ethanol; 2-(2-n-Butoxyethoxy)ethanol; Diethylene glycol mono-n-butyl ether; Butoxydiglycol; Diethylene gylcol monobutyl ether; Ektasolve DB; Glycol ether DB; Jeffersol DB; Butyl Oxitol glycol ether; 3,6-Dioxa-1-decanol; Butadigol; 3,6-Dioxadecanol; Butoxydiethylene glycol; Butyl di-icinol; Diethylene DB; n-Butyl carbitol; Diethylene glycol butyl ester; Ethanol 2-butoxyethoxy; NSC 407762; 2-2-Butoxyethoxy;ethanol; Dowanol OR; Ethylene glycol monobutyl ether; Glycol, monobutyl ether

Condensed phase thermochemistry data

Data compiled by: Eugene S. Domalski and Elizabeth D. Hearing
Constant pressure heat capacity of liquid
Cp,liquid (J/mol*K) | Temperature (K) | Reference | Comment |
---|---|---|---|
354.89 | 298.15 | Cobos, Casanova, et al., 1987 | Average of two measurements. |

Phase change data

Data compiled as indicated in comments:
BS - Robert L. Brown and Stephen E. Stein
TRC - Thermodynamics Research Center, NIST Boulder Laboratories, Chris Muzny director
AC - William E. Acree, Jr., James S. Chickos
Quantity | Value | Units | Method | Reference | Comment |
---|---|---|---|---|---|
Tboil | 504.2 | K | N/A | Weast and Grasselli, 1989 | BS |
Tboil | 504.35 | K | N/A | Lecat, 1947 | Uncertainty assigned by TRC = 0.5 K; TRC |
Quantity | Value | Units | Method | Reference | Comment |
Tc | 692.3 | K | N/A | Teja and Rosenthal, 1991 | Uncertainty assigned by TRC = 1.5 K; TRC |
Quantity | Value | Units | Method | Reference | Comment |
Pc | 27.90 | bar | N/A | Teja and Rosenthal, 1991 | Uncertainty assigned by TRC = 0.70 bar; TRC |
Enthalpy of vaporization
ΔvapH (kJ/mol) | Temperature (K) | Method | Reference | Comment |
---|---|---|---|---|
55.7 | 430. | A | Stephenson and Malanowski, 1987 | Based on data from 415. to 505. K.; AC |
Antoine Equation Parameters
log10(P) = A − (B / (T + C))
P = vapor pressure (bar)
T = temperature (K)
View plot Requires a JavaScript / HTML 5 canvas capable browser.
Temperature (K) | A | B | C | Reference | Comment |
---|---|---|---|---|---|
323.4 to 426.1 | 3.67536 | 1379.086 | -133.841 | Gardner and Brewer, 1937 | Coefficents calculated by NIST from author's data. |

Kovats' RI, non-polar column, isothermal

Column type | Active phase | Temperature (C) | I | Reference | Comment |
---|---|---|---|---|---|
Packed | SE-30 | 170. | 1193. | Voelkel, 1987 | He, Chromaton N Super (75-100 mesh); Column length: 1. m |

Kovats' RI, polar column, temperature ramp

Column type | Active phase | I | Reference | Comment |
---|---|---|---|---|
Capillary | Carbowax 20M | 1760. | Nishimura, Yamaguchi, et al., 1989 | 2. K/min; Column length: 50. m; Column diameter: 0.22 mm; Tstart: 80. C; Tend: 200. C |

Van Den Dool and Kratz RI, non-polar column, temperature ramp

Column type | Active phase | I | Reference | Comment |
---|---|---|---|---|
Capillary | DB-5 | 1192. | Dallüge, van Stee, et al., 2002 | 30. m/0.25 mm/1. μm, He, 2.5 K/min; Tstart: 50. C; Tend: 200. C |
Capillary | Ultra-2 | 1188. | Poskrobko, Linkiewicz, et al., 1994 | 25. m/0.32 mm/0.52 μm, H2, 8. K/min; Tstart: 50. C; Tend: 310. C |
Capillary | DB-5 | 1196. | Olson, Wong, et al., 1987 | 30. m/0.32 mm/1.0 μm, 5. K/min; Tstart: 20. C; Tend: 200. C |

Van Den Dool and Kratz RI, non-polar column, custom temperature program

Column type | Active phase | I | Reference | Comment |
---|---|---|---|---|
Capillary | VF-5MS | 1194.5 | Zheng and White, 2008 | 30. m/0.25 mm/0.25 μm, He; Program: not specified |
Capillary | DB-5MS | 1189. | Selli, Rannou, et al., 2006 | 30. m/0.32 mm/0.5 μm, He; Program: 50C => 5C/min => 200C => 8C/min => 260C(5min) |
Capillary | DB-5MS | 1198. | Varlet V., Knockaert C., et al., 2006 | 30. m/0.32 mm/0.5 μm, He; Program: 70C(1min) => 3C/min => 80C(1min) => 5C/min => 150C => 10C/min => 280C (4min) |
Packed | SE-30 | 1169. | Peng, Ding, et al., 1988 | Supelcoport; Chromosorb; Column length: 3.05 m; Program: 40C(5min) => 10C/min => 200C or 250C (60min) |
Packed | SE-30 | 1169. | Peng, Ding, et al., 1988 | Supelcoport; Chromosorb; Column length: 3.05 m; Program: 40C(5min) => 10C/min => 200C or 250C (60min) |

Van Den Dool and Kratz RI, polar column, temperature ramp

Column type | Active phase | I | Reference | Comment |
---|---|---|---|---|
Capillary | Supelcowax-10 | 1749. | Chung, Fung, et al., 2005 | 60. m/0.25 mm/0.25 μm, 35. C @ 5. min, 6. K/min, 195. C @ 60. min |
Capillary | DB-Wax | 1827. | Malliaa, Fernandez-Garcia, et al., 2005 | 60. m/0.32 mm/1. μm, He, 45. C @ 1. min, 5. K/min, 250. C @ 12. min |
Capillary | Supelcowax-10 | 1796. | Moreira, Trugo, et al., 2002 | 30. m/0.25 mm/0.25 μm, He, 3. K/min, 230. C @ 30. min; Tstart: 50. C |
Capillary | DB-Wax | 1786. | Shiratsuchi, Shimoda, et al., 1994 | 60. m/0.25 mm/0.25 μm, 2. K/min, 230. C @ 60. min; Tstart: 50. C |
Capillary | DB-Wax | 1786. | Shiratsuchi, Shimoda, et al., 1994, 2 | 60. m/0.25 mm/0.25 μm, He, 2. K/min, 230. C @ 60. min; Tstart: 50. C |

Van Den Dool and Kratz RI, polar column, custom temperature program

Column type | Active phase | I | Reference | Comment |
---|---|---|---|---|
Capillary | DB-Wax | 1796. | Pennarun, Prost, et al., 2003 | 30. m/0.32 mm/0.5 μm, He; Program: 50C => 6C/min => 70C => 4C/min => 150C => 10C/min => 250C |

Normal alkane RI, non-polar column, isothermal

Column type | Active phase | Temperature (C) | I | Reference | Comment |
---|---|---|---|---|---|
Packed | DC-400 | 150. | 1174. | Anderson, 1968 | Helium, Gas-Pak (60-80 mesh); Column length: 3.0 m |

Normal alkane RI, non-polar column, temperature ramp

Column type | Active phase | I | Reference | Comment |
---|---|---|---|---|
Capillary | SPB-5 | 1188. | Sebastian, Viallon-Fernandez, et al., 2003 | 60. m/0.32 mm/1.0 μm, Helium, 3. K/min; Tstart: 30. C; Tend: 230. C |
Capillary | Ultra-2 | 1195. | King, Matthews, et al., 1995 | 50. m/0.32 mm/0.52 μm, He, 40. C @ 3. min, 4. K/min, 250. C @ 30. min |
Capillary | DB-5 | 1184. | Berdague, Denoyer, et al., 1991 | 60. m/0.32 mm/1.0 μm, He, 3. K/min; Tstart: 40. C; Tend: 240. C |
Capillary | DB-5 | 1196.2 | Olson, Wong, et al., 1988 | 30. m/0.32 mm/1. μm, 5. K/min; Tstart: 20. C; Tend: 200. C |

Normal alkane RI, non-polar column, custom temperature program

Column type | Active phase | I | Reference | Comment |
---|---|---|---|---|
Capillary | SLB-5 MS | 1192. | Mondello, 2012 | 30. m/0.25 mm/0.25 μm, Helium; Program: not specified |
Capillary | SLB-5 MS | 1211. | Mondello, 2012 | 30. m/0.25 mm/0.25 μm, Helium; Program: not specified |
Capillary | Siloxane, 5 % Ph | 1186. | VOC BinBase, 2012 | Program: not specified |
Capillary | Polydimethyl siloxane, 5 % phenyl | 1186. | Skogerson, Wohlgemuth, et al., 2011 | Program: not specified |

Normal alkane RI, polar column, temperature ramp

Column type | Active phase | I | Reference | Comment |
---|---|---|---|---|
Capillary | DB-Wax | 1797. | Sekiwa, Kubota, et al., 1997 | He, 2. K/min; Column length: 60. m; Column diameter: 0.25 mm; Tstart: 60. C; Tend: 180. C |

Normal alkane RI, polar column, custom temperature program

Column type | Active phase | I | Reference | Comment |
---|---|---|---|---|
Capillary | Supelko CO Wax | 1823. | Vekiari, Orepoulou, et al., 2010 | 60. m/0.32 mm/0.25 μm, Helium; Program: 40 0C (5 min) 4 0C/min -> 75 0C 5 0C/min -> 250 0C (10 min) |
Capillary | Supelko CO Wax | 1823. | Vekiari, Orepoulou, et al., 2010 | 60. m/0.32 mm/0.25 μm, Helium; Program: not specified |
Capillary | Stabilwax | 1791. | Chinnici, Guerrero, et al., 2009 | 30. m/0.25 mm/0.25 μm, Helium; Program: 35 0C 3 0C/min -> 100 0C 5 0C/min -> 240 0C (10 min) |
Capillary | Supelcowax-10 | 1781. | de Simon, Estruelas, et al., 2009 | 30. m/0.25 mm/0.25 μm, Helium; Program: 45 0C 3 0C/min -> 230 0C (10 min) 10 0C/min -> 270 0C (21 min) |

References

Cobos, Casanova, et al., 1987
Cobos, J.C.; Casanova, C.; Roux-Desgranges, G.; Grolier, J.-P.E.,
Excess properties of mixtures of some n-alkoxyethanols with organic solvents. II. VEm and CEp,m with di-n-butylether at 298.15 K,
J. Chem. Thermodynam., 1987, 19, 791-796. [all data]
Weast and Grasselli, 1989
CRC Handbook of Data on Organic Compounds, 2nd Editon, Weast,R.C and Grasselli, J.G., ed(s)., CRC Press, Inc., Boca Raton, FL, 1989, 1. [all data]
Lecat, 1947
Lecat, M.,
Some azeotropes of which one constituant is heterocyclic nitrogen,
Ann. Soc. Sci. Bruxelles, Ser. 1, 1947, 61, 73. [all data]
Teja and Rosenthal, 1991
Teja, A.S.; Rosenthal, D.J.,
The critical pressures and temperatures of ten substances using a low residence time flow apparatus
in Experimental Results for Phase Equilibria and Pure Component Properties, DIPPR DATA Series No. 1, 1991. [all data]
Stephenson and Malanowski, 1987
Stephenson, Richard M.; Malanowski, Stanislaw,
Handbook of the Thermodynamics of Organic Compounds, 1987, https://doi.org/10.1007/978-94-009-3173-2
. [all data]
Gardner and Brewer, 1937
Gardner, George S.; Brewer, J. Edward,
Vapor Pressure of Commerical High-Boiling Organic Solvents,
Ind. Eng. Chem., 1937, 29, 2, 179-181, https://doi.org/10.1021/ie50326a014
. [all data]