2(3H)-Furanone, 3-acetyldihydro-3-methyl-
- Formula: C7H10O3
- Molecular weight: 142.1525
- IUPAC Standard InChIKey: VKDGCPFTXXDWQJ-UHFFFAOYSA-N
- CAS Registry Number: 1123-19-9
- Chemical structure:
View 3d structure (requires JavaScript / HTML 5) - Other names: α-Acetyl-α-methyl-gammabutyrolactone; α-acetyl-α-methyl-γ-butyrolactone

Phase change data

Data compiled by: Robert L. Brown and Stephen E. Stein
Reduced pressure boiling point
Tboil (K) | Pressure (bar) | Reference |
---|---|---|
368. to 373. | 0.007 | Buckingham and Donaghy, 1982 |

References

Buckingham and Donaghy, 1982
Buckingham, J.; Donaghy, S.M.,
Dictionary of Organic Compounds: Fifth Edition, Chapman and Hall, New York, 1982, 1. [all data]