2-Propanone, 1-cyclopentyl-
- Formula: C8H14O
- Molecular weight: 126.1962
- IUPAC Standard InChIKey: YYJCNNFQNIAISZ-UHFFFAOYSA-N
- CAS Registry Number: 1122-98-1
- Chemical structure:
View 3d structure (requires JavaScript / HTML 5) - Other names: Cyclopentylacetone; 3-Cyclopentylpropanone; Cyclopentyl-2-propanone; 1-Cyclopentyl-2-propanone; 2-Propanone, cyclopentyl-

Phase change data

Data compiled by: Robert L. Brown and Stephen E. Stein
Reduced pressure boiling point
Tboil (K) | Pressure (bar) | Reference |
---|---|---|
341. to 342. | 0.020 | Frinton Laboratories Inc., 1986 |

Normal alkane RI, non-polar column, custom temperature program

Column type | Active phase | I | Reference | Comment |
---|---|---|---|---|
Capillary | CP Sil 5 CB | 1075. | Guyot, Bouseta, et al., 1998 | 50. m/0.32 mm/1.2 μm, He; Program: 30C => 55C/min => 85C => 1C/min => 145C => 3C/min => 250C |

References

Frinton Laboratories Inc., 1986
Frinton Laboratories Inc.,
Catalog Number 11, Frinton Laboratories Inc., Vineland, NJ, 1986, 99. [all data]
Guyot, Bouseta, et al., 1998
Guyot, C.; Bouseta, A.; Scheirman, V.; Collin, S.,
Floral origin markers of chestnut and lime tree honeys,
J. Agric. Food Chem., 1998, 46, 2, 625-633, https://doi.org/10.1021/jf970510l
. [all data]