Ethanone, 1-(2-pyridinyl)-
- Formula: C7H7NO
- Molecular weight: 121.1366
- IUPAC Standard InChIKey: AJKVQEKCUACUMD-UHFFFAOYSA-N
- CAS Registry Number: 1122-62-9
- Chemical structure:
View 3d structure (requires JavaScript / HTML 5) - Other names: Ketone, methyl 2-pyridyl; Methyl 2-pyridyl ketone; 2-Acetylpyridine; 2-Pyridyl methyl ketone; 2-Acetopyridine; Acetyl pyridine; 1-(2-pyridinyl)ethanone; 2-AcetyIpyridine

Phase change data

Data compiled as indicated in comments:
BS - Robert L. Brown and Stephen E. Stein
AC - William E. Acree, Jr., James S. Chickos
Quantity | Value | Units | Method | Reference | Comment |
---|---|---|---|---|---|
Tboil | 461.7 | K | N/A | Aldrich Chemical Company Inc., 1990 | BS |
Tboil | 465.2 | K | N/A | Weast and Grasselli, 1989 | BS |
Tboil | 465. | K | N/A | Buckingham and Donaghy, 1982 | BS |
Quantity | Value | Units | Method | Reference | Comment |
ΔvapH° | 60.5 ± 0.3 | kJ/mol | C | Freitas, Oliveira, et al., 2007 | AC |

Kovats' RI, non-polar column, isothermal

View large format table.

Column type Active phase Temperature (C) I Reference Comment
CapillaryOV-101110.999.Terenina, Zhuravieva, et al., 199750. m/0.3 mm/0.4 μm, He

Kovats' RI, polar column, isothermal

View large format table.

Column type Active phase Temperature (C) I Reference Comment
CapillaryPEG-40M150.1608.Terenina, Zhuravieva, et al., 199750. m/0.3 mm/0.4 μm, He

Kovats' RI, polar column, temperature ramp

View large format table.

Column type Active phase I Reference Comment
CapillaryCarbowax 20M1618.N/AHe, 70. C @ 25. min, 2. K/min; Column length: 30. m; Column diameter: 0.25 mm; Tend: 170. C

Van Den Dool and Kratz RI, non-polar column, temperature ramp

View large format table.

Column type Active phase I Reference Comment
CapillaryBPX-51057.Ames, Guy, et al., 200150. m/0.32 mm/0.25 μm, He, 60. C @ 5. min, 4. K/min, 250. C @ 10. min
CapillaryDB-11001.Kim, 200160. m/0.32 mm/1. μm, He, 40. C @ 5. min, 2. K/min; Tend: 220. C
CapillaryHP-11026.Oh, Hartman, et al., 199250. m/0.32 mm/1.05 μm, He, 2. K/min, 260. C @ 10. min; Tstart: 40. C
CapillaryDB-11026.Izzo and Ho, 199150. m/0.32 mm/1.05 μm, He, 2. K/min, 260. C @ 40. min; Tstart: 40. C

Van Den Dool and Kratz RI, non-polar column, custom temperature program

View large format table.

Column type Active phase I Reference Comment
CapillaryBPX-51050.Bredie, Mottram, et al., 199850. m/0.32 mm/0.5 μm, He; Program: OC (5min) => 60C/min => 60C(5min) => 4C/min => 250C

Van Den Dool and Kratz RI, polar column, temperature ramp

View large format table.

Column type Active phase I Reference Comment
CapillarySupelcowax-101608.Chung, Yung, et al., 200260. m/0.25 mm/0.25 μm, He, 35. C @ 5. min, 2. K/min, 195. C @ 90. min
CapillarySupelcowax-101608.Chung, Yung, et al., 200160. m/0.25 mm/0.25 μm, He, 35. C @ 5. min, 2. K/min, 195. C @ 90. min
CapillaryDB-Wax1590.Kim, 200160. m/0.25 mm/0.25 μm, He, 40. C @ 5. min, 2. K/min, 200. C @ 30. min
CapillaryDB-Wax1586.Lee, Suriyaphan, et al., 200160. m/0.25 mm/0.25 μm, He, 2. K/min; Tstart: 40. C; Tend: 200. C
CapillaryPEG-20M1603.Shimoda, Nakada, et al., 199760. m/0.25 mm/0.25 μm, He, 2. K/min, 230. C @ 60. min; Tstart: 50. C
CapillaryDB-Wax1603.Shimoda, Shiratsuchi, et al., 199660. m/0.25 mm/0.25 μm, He, 2. K/min, 230. C @ 60. min; Tstart: 50. C
CapillaryCP-WAX 57CB1597.Salter L.J., Mottram D.S., et al., 198860. C @ 5. min, 4. K/min; Column length: 50. m; Column diameter: 0.32 mm; Tend: 200. C

Van Den Dool and Kratz RI, polar column, custom temperature program

View large format table.

Column type Active phase I Reference Comment
CapillaryDB-Wax1602.Hallier, Prost, et al., 200530. m/0.32 mm/0.5 μm, He; Program: 40C(5min) => 10C/min => 160C => 15C/min => 230C

Normal alkane RI, non-polar column, temperature ramp

View large format table.

Column type Active phase I Reference Comment
CapillaryHP-5 MS1030.Kim and Chung, 200930. m/0.25 mm/0.25 μm, Helium, 35. C @ 5. min, 2. K/min, 195. C @ 30. min
CapillaryUltra-1998.Du, Clery, et al., 200850. m/0.20 mm/0.33 μm, Helium, 2. K/min, 280. C @ 20. min; Tstart: 50. C
CapillaryHP-51034.Du, Clery, et al., 200850. m/0.20 mm/0.33 μm, Helium, 10. K/min, 280. C @ 8.5 min; Tstart: 50. C
CapillarySLB-5MS1045.Risticevic, Carasek, et al., 200810. m/0.18 mm/0.18 μm, Helium, 40. C @ 1.5 min, 10. K/min; Tend: 295. C
CapillaryHP-51034.8Leffingwell and Alford, 200560. m/0.32 mm/0.25 μm, He, 30. C @ 2. min, 2. K/min, 260. C @ 28. min
CapillaryDB-5MS1046.Lee, Suriyaphan, et al., 200160. m/0.25 mm/0.25 μm, He, 40. C @ 5. min, 2. K/min, 200. C @ 30. min
CapillaryHP-51036.Boylston and Viniyard, 199850. m/0.32 mm/0.52 μm, 35. C @ 15. min, 2. K/min, 250. C @ 45. min
CapillaryDB-11018.Chen and Ho, 199860. m/0.32 mm/1.0 μm, He, 3. K/min; Tstart: 40. C; Tend: 260. C
CapillaryOV-1011005.Roberts and Acree, 199412. m/0.32 mm/0.52 μm, 35. C @ 3. min, 4. K/min; Tend: 225. C
CapillaryOV-1011014.Egolf and Jurs, 19932. K/min; Column length: 50. m; Column diameter: 0.22 mm; Tstart: 80. C; Tend: 200. C
CapillaryDB-1991.Ishihara, Tsuneya, et al., 199260. m/0.25 mm/0.25 μm, He, 50. C @ 5. min, 3. K/min; Tend: 240. C
CapillaryDB-1993.Ishihara, Tsuneya, et al., 199260. m/0.25 mm/0.25 μm, He, 50. C @ 5. min, 3. K/min; Tend: 240. C
CapillaryDB-1998.Flath, Matsumoto, et al., 198960. m/0.32 mm/0.25 μm, 4. K/min; Tstart: 50. C; Tend: 250. C
CapillaryDB-1998.Flath, Matsumoto, et al., 198960. m/0.32 mm/0.25 μm, 4. K/min; Tstart: 50. C; Tend: 250. C
CapillaryMethyl Silicone1010.Lorenz, Stern, et al., 19834. K/min, 200. C @ 15. min; Column length: 25. m; Column diameter: 0.2 mm; Tstart: 50. C
CapillaryMethyl Silicone1011.Lorenz, Stern, et al., 19834. K/min, 200. C @ 15. min; Column length: 25. m; Column diameter: 0.2 mm; Tstart: 50. C

Normal alkane RI, non-polar column, custom temperature program

View large format table.

Column type Active phase I Reference Comment
CapillarySLB-5MS1032.Risticevic, Carasek, et al., 200810. m/0.18 mm/0.18 μm, Helium; Program: not specified
CapillarySE-541031.Lasekan, Buettner, et al., 200730. m/0.32 mm/0.25 μm; Program: 35C(2min) => 40C/min => 60C(2min) => 6C/min => 180C => 10C/min => 230C(10min)
CapillarySE-301014.Vinogradov, 2004Program: not specified

Normal alkane RI, polar column, temperature ramp

View large format table.

Column type Active phase I Reference Comment
CapillaryHP-Innowax1587.Du, Clery, et al., 200850. m/0.20 mm/0.33 μm, Helium, 10. K/min, 250. C @ 6. min; Tstart: 50. C
CapillaryHP-FFAP1615.Qian and Reineccius, 200225. m/0.32 mm/0.52 μm, 60. C @ 1. min, 5. K/min, 240. C @ 5. min
CapillaryDB-Wax1597.Buttery and Ling, 199830. C @ 4. min, 2. K/min, 170. C @ 30. min; Column length: 60. m; Column diameter: 0.25 mm
CapillaryPEG-20M1599.Kubota, Matsujage, et al., 199650. m/0.25 mm/0.25 μm, Nitrogen, 2. K/min; Tstart: 60. C; Tend: 180. C
CapillaryCarbowax 20M1600.Egolf and Jurs, 19932. K/min; Column length: 80. m; Column diameter: 0.2 mm; Tstart: 70. C; Tend: 170. C
CapillaryDB-Wax1567.Hatsuko, Kazuko, et al., 1992He, 60. C @ 10. min, 3. K/min; Column length: 30. m; Column diameter: 0.25 mm; Tend: 240. C
CapillaryCarbowax 20M1580.Vernin, Metzger, et al., 1992He, 3. K/min; Column length: 50. m; Column diameter: 0.33 mm; Tstart: 60. C; Tend: 200. C
CapillaryDB-Wax1587.Wong and Bernhard, 1988He, 70. C @ 8. min, 2. K/min; Column length: 30. m; Column diameter: 0.25 mm; Tend: 160. C
PackedCarbowax1590.Schieberle and Grosch, 1983He, Chromosorb G AW DMCS, 4. K/min; Column length: 3. m; Tstart: 60. C; Tend: 180. C

Normal alkane RI, polar column, custom temperature program

View large format table.

Column type Active phase I Reference Comment
CapillaryDB-FFAP1552.Lasekan, Buettner, et al., 200730. m/0.32 mm/0.25 μm; Program: 35C(2min) => 40C/min => 50C(2min) => 6C/min => 180C => 10C/min => 230C(10min)
CapillaryHP-Innowax1618.Viegas and Bassoli, 200760. m/0.32 mm/0.25 μm, Helium; Program: 40 0C (5 min) 4 0C/min -> 60 0C (5 min) 8 0C/min -> 250 0C (3 min)
CapillaryHP-Innowax1599.Viegas and Bassoli, 200760. m/0.32 mm/0.25 μm, Helium; Program: not specified
CapillaryCarbowax 20M1600.Vinogradov, 2004Program: not specified
CapillaryDB-Wax1560.Hatsuko, Kazuko, et al., 1992He; Column length: 30. m; Column diameter: 0.25 mm; Program: not specified
CapillaryCarbowax1585.Baltes and Bochmann, 1987Program: not specified
CapillaryCarbowax1585.Baltes and Bochmann, 1987Program: not specified
CapillaryCarbowax1586.Baltes and Bochmann, 1987Program: not specified
CapillaryCarbowax1587.Baltes and Bochmann, 1987Program: not specified
CapillaryCarbowax1588.Baltes and Bochmann, 1987Program: not specified

References

Aldrich Chemical Company Inc., 1990
Aldrich Chemical Company Inc.,
Catalog Handbook of Fine Chemicals, Aldrich Chemical Company, Inc., Milwaukee WI, 1990, 1. [all data]
Weast and Grasselli, 1989
CRC Handbook of Data on Organic Compounds, 2nd Editon, Weast,R.C and Grasselli, J.G., ed(s)., CRC Press, Inc., Boca Raton, FL, 1989, 1. [all data]
Buckingham and Donaghy, 1982
Buckingham, J.; Donaghy, S.M.,
Dictionary of Organic Compounds: Fifth Edition, Chapman and Hall, New York, 1982, 1. [all data]
Freitas, Oliveira, et al., 2007
Freitas, Vera L.S.; Oliveira, Liliana I.P.; Ribeiro da Silva, Maria D.M.C.,
Standard molar enthalpies of formation of the acetylpyridine isomers,
The Journal of Chemical Thermodynamics, 2007, 39, 1, 39-43, https://doi.org/10.1016/j.jct.2006.06.004
. [all data]