Ethanol, 2-(hexyloxy)-
- Formula: C8H18O2
- Molecular weight: 146.2273
- IUPAC Standard InChIKey: UPGSWASWQBLSKZ-UHFFFAOYSA-N
- CAS Registry Number: 112-25-4
- Chemical structure:
View 3d structure (requires JavaScript / HTML 5) - Other names: n-Hexyl Cellosolve; Ethylene glycol monohexyl ether; Ethylene glycol n-hexyl ether; Glycol monohexyl ether; Hexyl cellosolve; 2-(Hexyloxy)ethanol; 2-Hexoxyethanol; Ethylene glycol mono-n-hexyl ether; Cellosolve, n-hexyl-

Phase change data

Data compiled as indicated in comments:
BS - Robert L. Brown and Stephen E. Stein
AC - William E. Acree, Jr., James S. Chickos
Quantity | Value | Units | Method | Reference | Comment |
---|---|---|---|---|---|
Tboil | 481.2 | K | N/A | Weast and Grasselli, 1989 | BS |
Enthalpy of vaporization
ΔvapH (kcal/mol) | Temperature (K) | Method | Reference | Comment |
---|---|---|---|---|
13.0 | 378. | A | Stephenson and Malanowski, 1987 | Based on data from 363. to 483. K.; AC |

Kovats' RI, non-polar column, isothermal

Column type | Active phase | Temperature (C) | I | Reference | Comment |
---|---|---|---|---|---|
Packed | SE-30 | 170. | 1090. | Voelkel, 1987 | He, Chromaton N Super (75-100 mesh); Column length: 1. m |

Normal alkane RI, non-polar column, isothermal

Column type | Active phase | Temperature (C) | I | Reference | Comment |
---|---|---|---|---|---|
Packed | DC-400 | 150. | 1106. | Anderson, 1968 | Helium, Gas-Pak (60-80 mesh); Column length: 3.0 m |

References

Weast and Grasselli, 1989
CRC Handbook of Data on Organic Compounds, 2nd Editon, Weast,R.C and Grasselli, J.G., ed(s)., CRC Press, Inc., Boca Raton, FL, 1989, 1. [all data]
Stephenson and Malanowski, 1987
Stephenson, Richard M.; Malanowski, Stanislaw,
Handbook of the Thermodynamics of Organic Compounds, 1987, https://doi.org/10.1007/978-94-009-3173-2
. [all data]
Voelkel, 1987
Voelkel, A.,
Retention Indices and Thermodynamic Functions of Solution for Model Non-Ionic Surfactants in Standard Stationary Phases Determined by Gas Chromatography,
J. Chromatogr., 1987, 387, 95-104, https://doi.org/10.1016/S0021-9673(01)94516-9
. [all data]
Anderson, 1968
Anderson, D.G.,
USe of Kovats retention indices and response factors for the qualitative and quantitative analysis of coating solvents,
J. Paint Technol., 1968, 40, 527, 549-557. [all data]