1,2-Ethanediamine, N,N'-bis(2-aminoethyl)-
- Formula: C6H18N4
- Molecular weight: 146.2339
- IUPAC Standard InChIKey: VILCJCGEZXAXTO-UHFFFAOYSA-N
- CAS Registry Number: 112-24-3
- Chemical structure:
View 3d structure (requires JavaScript / HTML 5) - Species with the same structure:
- Other names: Triethylenetetramine; DEH 24; N,N'-Bis(2-Aminoethyl)-1,2-ethanediamine; N,N'-Bis(2-aminoethyl)ethylenediamine; Trien; TECZA; TETA; 1,4,7,10-Tetraazadecane; 1,8-Diamino-3,6-Diazaoctane; 3,6-Diazaoctane-1,8-diamine; 3,6-Diazaoctanethylenediamin; Ethylenediamine, N,N'-bis(2-aminoethyl)-; Araldite HY 951; Trientine; Araldite Hardener HY 951; N,N'-Bis(2-aminoethyl)-1,2-diaminoethane; Trientene; Ethanediamine, N,N'-bis(2-aminoethyl)-; 1,2-Ethanediamine, N1,N2-bis(2-aminoethyl)-; HY 951; NSC 443

Condensed phase thermochemistry data

Data compiled by: Eugene S. Domalski and Elizabeth D. Hearing
Constant pressure heat capacity of liquid
Cp,liquid (J/mol*K) | Temperature (K) | Reference | Comment |
---|---|---|---|
376. | 333. | Bobylev, Kamskaya, et al., 1988 | T = 333 to 473 K. |

Phase change data

Data compiled as indicated in comments:
BS - Robert L. Brown and Stephen E. Stein
AC - William E. Acree, Jr., James S. Chickos
Quantity | Value | Units | Method | Reference | Comment |
---|---|---|---|---|---|
Tboil | 539.7 | K | N/A | Weast and Grasselli, 1989 | BS |
Quantity | Value | Units | Method | Reference | Comment |
ΔvapH° | 84.7 ± 0.3 | kJ/mol | GS | Efimova, Emel'yanenko, et al., 2010 | Based on data from 338. to 373. K.; AC |
ΔvapH° | 75.6 | kJ/mol | TGA | Afzal, Butt, et al., 1988 | Based on data from 294. to 325. K. See also Efimova, Emel'yanenko, et al., 2010.; AC |
ΔvapH° | 71.0 ± 2.6 | kJ/mol | N/A | Sivokova, Matejicek, et al., 1967 | Based on data from 431. to 492. K. See also Efimova, Emel'yanenko, et al., 2010.; AC |
Reduced pressure boiling point
Tboil (K) | Pressure (bar) | Reference | Comment |
---|---|---|---|
430.2 | 0.027 | Weast and Grasselli, 1989 | BS |
Enthalpy of vaporization
ΔvapH (kJ/mol) | Temperature (K) | Method | Reference | Comment |
---|---|---|---|---|
59.8 | 446. | A | Stephenson and Malanowski, 1987 | Based on data from 431. to 550. K. See also Dykyj, 1972.; AC |

Reaction thermochemistry data

Data compiled by: Hussein Y. Afeefy, Joel F. Liebman, and Stephen E. Stein
Individual Reactions
By formula: C4H13N3 + C2H5N = C6H18N4
Quantity | Value | Units | Method | Reference | Comment |
---|---|---|---|---|---|
ΔrH° | 83.3 ± 4.2 | kJ/mol | Cm | Dalin, Bobylev, et al., 1988 | liquid phase; solvent: Aqueous HCl; Kinetic |
By formula: C6H18N4 + C2H5N = C8H23N5
Quantity | Value | Units | Method | Reference | Comment |
---|---|---|---|---|---|
ΔrH° | 83.3 ± 4.6 | kJ/mol | Cm | Dalin, Bobylev, et al., 1988 | liquid phase; solvent: Aqueous HCl; Kinetic |

References

Bobylev, Kamskaya, et al., 1988
Bobylev, V.A.; Kamskaya, O.I.; Kossoi, A.A.; Koludarova, E.Yu.,
Investigation of the heat capacity of ethyleneamines by differential scanning calorimetry,
Zhur. Obshch. Khim., 1988, 58, 2536-2538. [all data]
Weast and Grasselli, 1989
CRC Handbook of Data on Organic Compounds, 2nd Editon, Weast,R.C and Grasselli, J.G., ed(s)., CRC Press, Inc., Boca Raton, FL, 1989, 1. [all data]
Efimova, Emel'yanenko, et al., 2010
Efimova, Anastasia A.; Emel'yanenko, Vladimir N.; Verevkin, Sergey P.; Chernyak, Yury,
Vapour pressure and enthalpy of vaporization of aliphatic poly-amines,
The Journal of Chemical Thermodynamics, 2010, 42, 3, 330-336, https://doi.org/10.1016/j.jct.2009.09.003
. [all data]
Afzal, Butt, et al., 1988
Afzal, M.; Butt, P.K.; Iqbal, M.J.,
J. Sci. Ind. Res., 1988, 31, 404. [all data]
Sivokova, Matejicek, et al., 1967
Sivokova, M.; Matejicek, A.; Juracka, F.,
Chem. Prum., 1967, 17, 4, 213. [all data]
Stephenson and Malanowski, 1987
Stephenson, Richard M.; Malanowski, Stanislaw,
Handbook of the Thermodynamics of Organic Compounds, 1987, https://doi.org/10.1007/978-94-009-3173-2
. [all data]
Dykyj, 1972
Dykyj, J.,
Petrochemia, 1972, 12, 1, 13. [all data]
Dalin, Bobylev, et al., 1988
Dalin, A.R.; Bobylev, V.A.; Suslikov, V.F.; Kamskaya, O.I.; Tereshchenko, G.F.,
Nucleophilic cleavage and the formation of saturated heterocycles. VII. Kinetic and thermochemical study of reactions of aziridine with ethylene amines,
J. Gen. Chem. USSR, 1988, 58, 1868-1871. [all data]