2,5-Furandione, 3,4-dichloro-
- Formula: C4Cl2O3
- Molecular weight: 166.947
- IUPAC Standard InChIKey: AGULWIQIYWWFBJ-UHFFFAOYSA-N
- CAS Registry Number: 1122-17-4
- Chemical structure:
View 3d structure (requires JavaScript / HTML 5) - Other names: Maleic anhydride, dichloro-; Dichloromaleic acid anhydride; Dichloromaleic anhydride; 2,3-Dichloromaleic anhydride; 2,3-Dichloromaleic acid anhydride

Gas phase ion energetics data

Data compiled by: John E. Bartmess
Electron affinity determinations
EA (eV) | Method | Reference | Comment |
---|---|---|---|
1.904 ± 0.087 | IMRE | Paul and Kebarle, 1989 | ΔGea(423 K) = -43.5±1 kcal/mol, ΔS = -1±3 eu(est.) |

References

Paul and Kebarle, 1989
Paul, G.; Kebarle, P.,
Electron Affinities of Cyclic Unsaturated Dicarbonyls: Maleic Anhydrides, Maleimides, and Cyclopentendione,
J. Am. Chem. Soc., 1989, 111, 2, 464, https://doi.org/10.1021/ja00184a009
. [all data]