Azocine, octahydro-
- Formula: C7H15N
- Molecular weight: 113.2007
- IUPAC Standard InChIKey: QXNDZONIWRINJR-UHFFFAOYSA-N
- CAS Registry Number: 1121-92-2
- Chemical structure:
View 3d structure (requires JavaScript / HTML 5) - Other names: Azacyclooctane; Heptamethyleneimine; Heptamethylenimine; Octahydroazocine; Perhydroazocine

Condensed phase thermochemistry data

Data compiled by: Eugene S. Domalski and Elizabeth D. Hearing
Constant pressure heat capacity of liquid
Cp,liquid (J/mol*K) | Temperature (K) | Reference |
---|---|---|
230. | 298. | Conti, Gianni, et al., 1976 |

Phase change data

Data compiled as indicated in comments:
BS - Robert L. Brown and Stephen E. Stein
AC - William E. Acree, Jr., James S. Chickos
Reduced pressure boiling point
Tboil (K) | Pressure (bar) | Reference | Comment |
---|---|---|---|
325.2 | 0.020 | Weast and Grasselli, 1989 | BS |
Enthalpy of vaporization
ΔvapH (kJ/mol) | Temperature (K) | Method | Reference | Comment |
---|---|---|---|---|
46.5 | 288. | A | Stephenson and Malanowski, 1987 | Based on data from 273. to 313. K.; AC |

Normal alkane RI, non-polar column, custom temperature program

Column type | Active phase | I | Reference | Comment |
---|---|---|---|---|
Capillary | Methyl Silicone | 938. | Farkas, Héberger, et al., 2004 | Program: not specified |

References

Conti, Gianni, et al., 1976
Conti, G.; Gianni, P.; Matteoli, E.; Mengheri, M.,
Capacita termiche molari di alcuni composti organici mono- e bifunzionali nel liquido puro e in soluzione acquosa a 25C,
Chim. Ind. (Milan), 1976, 58, 225. [all data]
Weast and Grasselli, 1989
CRC Handbook of Data on Organic Compounds, 2nd Editon, Weast,R.C and Grasselli, J.G., ed(s)., CRC Press, Inc., Boca Raton, FL, 1989, 1. [all data]
Stephenson and Malanowski, 1987
Stephenson, Richard M.; Malanowski, Stanislaw,
Handbook of the Thermodynamics of Organic Compounds, 1987, https://doi.org/10.1007/978-94-009-3173-2
. [all data]
Farkas, Héberger, et al., 2004
Farkas, O.; Héberger, K.; Zenkevich, I.G.,
Quantitative structure-retention relationships. XIV. Prediction of gas chromatographic retention indices for saturated O-, N-, and S-heterocyclic compounds,
Chemom. Intell. Lab. Syst., 2004, 72, 2, 173-184, https://doi.org/10.1016/j.chemolab.2004.01.012
. [all data]