Acetic acid, decyl ester
- Formula: C12H24O2
- Molecular weight: 200.3178
- IUPAC Standard InChIKey: NUPSHWCALHZGOV-UHFFFAOYSA-N
- CAS Registry Number: 112-17-4
- Chemical structure:
View 3d structure (requires JavaScript / HTML 5) - Other names: n-Decyl acetate; Acetate C 10; Decyl acetate; 1-Decanol acetate; n-Decyl ethanoate; Decyl ester of acetic acid; Acetic acid, n-decyl ester; Decanol acetate; Decyl alcohol, acetate

Phase change data

Data compiled as indicated in comments:
TRC - Thermodynamics Research Center, NIST Boulder Laboratories, Chris Muzny director
AC - William E. Acree, Jr., James S. Chickos
Quantity | Value | Units | Method | Reference | Comment |
---|---|---|---|---|---|
Tboil | 517.15 | K | N/A | Komppa and Talvitie, 1932 | Uncertainty assigned by TRC = 1. K; TRC |
Quantity | Value | Units | Method | Reference | Comment |
ΔvapH° | 70.2 ± 0.3 | kJ/mol | GS | Krasnykh, Verevkin, et al., 2006 | Based on data from 284. to 321. K.; AC |
ΔvapH° | 71.6 | kJ/mol | GC | Koutek, Hoskovec, et al., 1997 | Based on data from 313. to 358. K. See also Ova, Koultek, et al., 2000.; AC |
Enthalpy of vaporization
ΔvapH (kJ/mol) | Temperature (K) | Method | Reference | Comment |
---|---|---|---|---|
61.9 | 378. | A | Stephenson and Malanowski, 1987 | Based on data from 363. to 515. K.; AC |
72. | 306. | GC | Olsson, J«65533»nsson, et al., 1983 | Based on data from 299. to 313. K.; AC |
56.3 | 460. | DTA | Meyer, Awe, et al., 1980 | Based on data from 445. to 530. K.; AC |

Normal alkane RI, polar column, temperature ramp

Data compiled by: NIST Mass Spectrometry Data Center, William E. Wallace, director

Column type CapillaryCapillaryCapillaryCapillaryCapillary
Active phase DB-WaxCarbowax 20MDB-WaxDB-WaxDB-Wax
Column length (m) 30.25.60.60.60.
Carrier gas HeliumHeliumN2
Substrate
Column diameter (mm) 0.250.250.250.250.25
Phase thickness (μm) 0.250.400.250.250.25
Tstart (C) 40.60.70.70.70.
Tend (C) 230.260.230.230.230.
Heat rate (K/min) 3.5.2.2.2.
Initial hold (min) 2. 2.2.2.
Final hold (min) 5.40.20.20.20.
I 1677.1687.1691.1678.1677.
ReferenceZhao, Xu, et al., 2009Kafkas and Paydas, 2007Choi, 2006Lan Phi N.T., Nishiyama C., et al., 2006Lan Phi N.T., Nishiyama C., et al., 2006
Comment MSDC-RI MSDC-RI MSDC-RI MSDC-RI MSDC-RI
Column type CapillaryCapillaryCapillaryCapillaryCapillary
Active phase DB-WaxDB-WaxDB-WaxDB-WaxDB-Wax
Column length (m) 60.60.60.60.60.
Carrier gas  N2N2N2He
Substrate
Column diameter (mm) 0.250.250.250.250.25
Phase thickness (μm) 0.250.250.250.250.25
Tstart (C) 70.70.70.70.40.
Tend (C) 230.230.230.230.200.
Heat rate (K/min) 2.2.2.2.2.
Initial hold (min) 2.2.2.2.2.
Final hold (min) 20.20.20.20.
I 1680.1693.1692.1671.1669.
ReferenceSawamura, Onishi, et al., 2006Choi, 2004Choi, 2004, 2Tu, Onishi, et al., 2002Umano, Hagi, et al., 2002
Comment MSDC-RI MSDC-RI MSDC-RI MSDC-RI MSDC-RI
Column type CapillaryCapillary
Active phase DB-WaxCarbowax 20M
Column length (m) 60.150.
Carrier gas H2
Substrate
Column diameter (mm) 0.320.64
Phase thickness (μm) 0.25
Tstart (C) 60.50.
Tend (C) 220.170.
Heat rate (K/min) 3.1.
Initial hold (min)
Final hold (min)  30.
I 1669.1670.
ReferenceWerkhoff, Güntert, et al., 1998Buttery, Kamm, et al., 1984
Comment MSDC-RI MSDC-RI

Van Den Dool and Kratz RI, polar column, temperature ramp

Data compiled by: NIST Mass Spectrometry Data Center, William E. Wallace, director

Column type CapillaryCapillaryCapillaryCapillaryCapillary
Active phase DB-WaxMegawaxSupelcowaxDB-WaxMegawax
Column length (m) 60.30.25.60.30.
Carrier gas N2He N2He
Substrate
Column diameter (mm) 0.250.250.250.250.25
Phase thickness (μm) 0.250.250.250.250.25
Tstart (C) 70.40.35.70.40.
Tend (C) 230.220.225.230.220.
Heat rate (K/min) 2.2.4.2.2.
Initial hold (min) 2.6.5.2.6.
Final hold (min) 20.10.10.20.10.
I 1691.1662.1692.1691.1662.
ReferenceChoi, 2005Verzera, Trozzi, et al., 2005Chisholm, Wilson, et al., 2003Choi, 2003Verzera, Trozzi, et al., 2003
Comment MSDC-RI MSDC-RI MSDC-RI MSDC-RI MSDC-RI
Column type CapillaryCapillaryCapillaryCapillaryPacked
Active phase DB-WaxDB-WaxMegawaxCarbowax 20MCarbowax 20M
Column length (m) 60.60.30.60.
Carrier gas N2N2HeHe
Substrate     Celite 545
Column diameter (mm) 0.250.250.250.32
Phase thickness (μm) 0.250.250.250.425
Tstart (C) 70.70.40.45.75.
Tend (C) 230.230.220.300.228.
Heat rate (K/min) 2.2.2.3.4.6
Initial hold (min)  2.6.3.
Final hold (min) 20.20.10.20.
I 1683.1690.1662.1676.1674.
ReferenceChoi, Kim. M.-S.L., et al., 2002Choi and Sawamura, 2000Verzera, Trozzi, et al., 2000Mondello, Dugo, et al., 1995van den Dool and Kratz, 1963
Comment MSDC-RI MSDC-RI MSDC-RI MSDC-RI MSDC-RI

Kovats' RI, non-polar column, isothermal

Data compiled by: NIST Mass Spectrometry Data Center, William E. Wallace, director

Column type CapillaryCapillaryCapillaryCapillaryCapillary
Active phase DB-1DB-5SE-30SE-30SE-30
Column length (m) 30.60. 40.25.
Carrier gas N2N2  N2
Substrate
Column diameter (mm) 0.2560.321 0.350.33
Phase thickness (μm) 0.250.25 0.35
Temperature (C) 80.80.150.100.140.
I 1389.271410.321391.1391.31393.
ReferenceMijin and Antonovic, 2006Mijin and Antonovic, 2006Tudor and Moldovan, 1999Tudor, 1997Haken and Korhonen, 1986
Comment MSDC-RI MSDC-RI MSDC-RI MSDC-RI MSDC-RI
Column type CapillaryCapillaryCapillaryCapillaryPacked
Active phase SE-30SE-30SE-30OV-101SE-30
Column length (m) 25.25.25.15.3.0
Carrier gas N2N2N2N2
Substrate
Column diameter (mm) 0.330.330.330.22
Phase thickness (μm)
Temperature (C) 160.180.200.200.150.
I 1393.1389.1384.1389.21399.
ReferenceHaken and Korhonen, 1986Haken and Korhonen, 1986Haken and Korhonen, 1986Komárek, Hornová, et al., 1982Bierl, Beroza, et al., 1972
Comment MSDC-RI MSDC-RI MSDC-RI MSDC-RI MSDC-RI
Column type Packed
Active phase SE-30
Column length (m) 2.
Carrier gas
Substrate Chromosorb W
Column diameter (mm)
Phase thickness (μm)
Temperature (C) 180.
I 1385.
ReferenceZarazir, Chovin, et al., 1970
Comment MSDC-RI

Kovats' RI, non-polar column, temperature ramp

Data compiled by: NIST Mass Spectrometry Data Center, William E. Wallace, director

Column type CapillaryCapillaryCapillary
Active phase CP Sil 8 CBCP Sil 8 CBDB-1
Column length (m) 30.30.60.
Carrier gas H2H2He
Substrate
Column diameter (mm) 0.250.250.32
Phase thickness (μm) 0.250.250.25
Tstart (C) 50.50.30.
Tend (C) 220.220.210.
Heat rate (K/min) 3.3.2.
Initial hold (min) 2.2.4.
Final hold (min)
I 1419.1417.1394.
ReferenceTayoub, Schwob, et al., 2006Tayoub, Schwob, et al., 2006, 2Takeoka, Buttery, et al., 1992
Comment MSDC-RI MSDC-RI MSDC-RI

Normal alkane RI, non-polar column, custom temperature program

Data compiled by: NIST Mass Spectrometry Data Center, William E. Wallace, director

Column type CapillaryCapillaryCapillaryCapillaryCapillary
Active phase DB-5DB-1BPX-5BPX-5BP-5
Column length (m) 60.30.30.30.25.
Carrier gas HeliumHydrogenHeliumHeliumHelium
Substrate
Column diameter (mm) 0.250.250.250.250.32
Phase thickness (μm) 1.000.250.250.250.50
Program 40 0C 4 0C/min -> 230 0C 100 0C/min -> 260 0C (11.7 min)45 0C 3 0C/min -> 175 0C 15 0C/min -> 300 0C (10 min)35 0C (5 min) 3 0C/min -> 210 0C 40 0C/min -> 240 0C (10 min)not specified60 0C 6 0C/min -> 210 0C 10 0C/min -> 290 0C (10 min)
I 1403.1400.1414.1411.1418.
ReferenceMiyazaki, Plotto, et al., 2011Mendes, Trindade, et al., 2009se Souza, Cardeal, et al., 2009se Souza, Cardeal, et al., 2009Eyres, Dufour, et al., 2005
Comment MSDC-RI MSDC-RI MSDC-RI MSDC-RI MSDC-RI
Column type CapillaryCapillaryCapillaryCapillaryCapillary
Active phase BP-5DB-5SE-30OV-101OV-101
Column length (m) 25.30.  50.
Carrier gas HeliumHe  N2
Substrate
Column diameter (mm) 0.320.25  0.25
Phase thickness (μm) 0.500.25
Program not specified40C(1min) => 9C/min => 130C => 2C/min => 230Cnot specifiednot specifiednot specified
I 1408.1406.1393.1393.1394.
ReferenceEyres, Dufour, et al., 2005Hamm, Bleton, et al., 2005Vinogradov, 2004Krings, Banavara, et al., 2003Yang, 2001
Comment MSDC-RI MSDC-RI MSDC-RI MSDC-RI MSDC-RI
Column type CapillaryCapillary
Active phase OV-1, SE-30, Methyl silicone, SP-2100, OV-101, DB-1, etc.OV-1, SE-30, Methyl silicone, SP-2100, OV-101, DB-1, etc.
Column length (m) 50.50.
Carrier gas HydrogenHydrogen
Substrate
Column diameter (mm) 0.320.32
Phase thickness (μm)
Program not specifiednot specified
I 1395.1400.
ReferenceWaggott and Davies, 1984Waggott and Davies, 1984
Comment MSDC-RI MSDC-RI

References

Komppa and Talvitie, 1932
Komppa, G.; Talvitie, Y.,
The normal decyl series,
J. Prakt. Chem., 1932, 135, 193-203. [all data]
Krasnykh, Verevkin, et al., 2006
Krasnykh, Eugen L.; Verevkin, Sergey P.; Koutek, Bohumir; Doubsky, Jan,
Vapour pressures and enthalpies of vaporization of a series of the linear n-alkyl acetates,
The Journal of Chemical Thermodynamics, 2006, 38, 6, 717-723, https://doi.org/10.1016/j.jct.2005.08.003
. [all data]
Koutek, Hoskovec, et al., 1997
Koutek, Bohumír; Hoskovec, Michal; Vrkocová, Pavlína; Feltl, Ladislav,
Gas chromatographic determination of vapour pressures of pheromone-like compounds IV. Acetates, a reinvestigation,
Journal of Chromatography A, 1997, 759, 1-2, 93-109, https://doi.org/10.1016/S0021-9673(96)00775-3
. [all data]
Ova, Koultek, et al., 2000
Ova, P.V.; Koultek, B.; Hoskovec, M.,
Practice Oriented Results on Use and Production of Neem Ingredients and Pheromones VI, H. Kleeberg and C.P.W. Zebitz, ed(s)., Druck and Graphic, Giessen, 2000, 211-218. [all data]
Stephenson and Malanowski, 1987
Stephenson, Richard M.; Malanowski, Stanislaw,
Handbook of the Thermodynamics of Organic Compounds, 1987, https://doi.org/10.1007/978-94-009-3173-2
. [all data]
Olsson, J«65533»nsson, et al., 1983
Olsson, Anne-Marie; J«65533»nsson, Jan «65533»ke; Thelin, Bernt; Liljefors, Tommy,
Determination of the vapor pressures of moth sex pheromone components by a gas chromatographic method,
J Chem Ecol, 1983, 9, 3, 375-385, https://doi.org/10.1007/BF00988456
. [all data]
Meyer, Awe, et al., 1980
Meyer, Edwin F.; Awe, Michael J.; Wagner, Robert E.,
Cohesive energies in polar organic liquids. 4. n-Alkyl acetates,
J. Chem. Eng. Data, 1980, 25, 4, 371-374, https://doi.org/10.1021/je60087a030
. [all data]