Dodecanoyl chloride
- Formula: C12H23ClO
- Molecular weight: 218.763
- IUPAC Standard InChIKey: NQGIJDNPUZEBRU-UHFFFAOYSA-N
- CAS Registry Number: 112-16-3
- Chemical structure:
View 3d structure (requires JavaScript / HTML 5) - Other names: Lauroyl chloride; n-Dodecanoyl chloride; Lauric acid, chloride; Dodecanoic acid, chloride

Phase change data

Data compiled by: Robert L. Brown and Stephen E. Stein
Reduced pressure boiling point
Tboil (K) | Pressure (bar) | Reference |
---|---|---|
408.7 | 0.015 | Aldrich Chemical Company Inc., 1990 |
418.2 | 0.024 | Weast and Grasselli, 1989 |

Reaction thermochemistry data

Data compiled by: Hussein Y. Afeefy, Joel F. Liebman, and Stephen E. Stein
Individual Reactions
By formula: C12H23ClO + H2O = C12H24O2 + HCl
Quantity | Value | Units | Method | Reference | Comment |
---|---|---|---|---|---|
ΔrH° | -71. ± 3. | kJ/mol | Cm | Roth and Rist-Schumacher, 1944 | solid phase |

References

Aldrich Chemical Company Inc., 1990
Aldrich Chemical Company Inc.,
Catalog Handbook of Fine Chemicals, Aldrich Chemical Company, Inc., Milwaukee WI, 1990, 1. [all data]
Weast and Grasselli, 1989
CRC Handbook of Data on Organic Compounds, 2nd Editon, Weast,R.C and Grasselli, J.G., ed(s)., CRC Press, Inc., Boca Raton, FL, 1989, 1. [all data]
Roth and Rist-Schumacher, 1944
Roth, W.A.; Rist-Schumacher, E.,
Beitrag zur thermochemie der sulfonsauren und saurechlorid,
Z. Electrochem., 1944, 50, 7-9. [all data]