4-Ethyl-1,3-dioxane
- Formula: C6H12O2
- Molecular weight: 116.1583
- CAS Registry Number: 1121-61-5

Phase change data

Data compiled by: William E. Acree, Jr., James S. Chickos
Enthalpy of vaporization
ΔvapH (kJ/mol) | Temperature (K) | Method | Reference | Comment |
---|---|---|---|---|
39.3 | 377. | A | Stephenson and Malanowski, 1987 | Based on data from 362. to 412. K. |

References

Stephenson and Malanowski, 1987
Stephenson, Richard M.; Malanowski, Stanislaw,
Handbook of the Thermodynamics of Organic Compounds, 1987, https://doi.org/10.1007/978-94-009-3173-2
. [all data]