Acetic acid, octyl ester
- Formula: C10H20O2
- Molecular weight: 172.2646
- IUPAC Standard InChIKey: YLYBTZIQSIBWLI-UHFFFAOYSA-N
- CAS Registry Number: 112-14-1
- Chemical structure:
View 3d structure (requires JavaScript / HTML 5) - Other names: n-Octyl acetate; Caprylyl acetate; Octyl acetate; Octyl alcohol acetate; 1-Octyl acetate; Acetic acid n-octyl ester; n-Octanyl acetate; n-Octyl ethanoate; Acetate C-8; 1-Octanol acetate; NSC 67348; Octanol acetate

Phase change data

Data compiled as indicated in comments:
BS - Robert L. Brown and Stephen E. Stein
TRC - Thermodynamics Research Center, NIST Boulder Laboratories, Chris Muzny director
AC - William E. Acree, Jr., James S. Chickos
Quantity | Value | Units | Method | Reference | Comment |
---|---|---|---|---|---|
Tboil | 483. ± 4. | K | AVG | N/A | Average of 6 values; Individual data points |
Quantity | Value | Units | Method | Reference | Comment |
Tfus | 234.65 | K | N/A | Timmermans and Mattaar, 1921 | Uncertainty assigned by TRC = 0.5 K; TRC |
Quantity | Value | Units | Method | Reference | Comment |
ΔvapH° | 60.7 ± 0.4 | kJ/mol | GS | Krasnykh, Verevkin, et al., 2006 | Based on data from 274. to 309. K.; AC |
ΔvapH° | 61.7 | kJ/mol | GC | Defibaugh, Carrillo-Nava, et al., 1997 | AC |
Reduced pressure boiling point
Tboil (K) | Pressure (bar) | Reference | Comment |
---|---|---|---|
385.7 | 0.040 | Weast and Grasselli, 1989 | BS |
Enthalpy of vaporization
ΔvapH (kJ/mol) | Temperature (K) | Method | Reference | Comment |
---|---|---|---|---|
54.9 | 349. | A | Stephenson and Malanowski, 1987 | Based on data from 334. to 417. K.; AC |
47.8 | 360. | A | Stephenson and Malanowski, 1987 | Based on data from 345. to 472. K.; AC |

Normal alkane RI, non-polar column, custom temperature program

Data compiled by: NIST Mass Spectrometry Data Center, William E. Wallace, director

Column type CapillaryCapillaryCapillaryCapillaryCapillary
Active phase DB-5 MSSiloxane, 5 % PhHP-5DB-5Polydimethyl siloxane, 5 % phenyl
Column length (m) 30. 30.60.
Carrier gas Helium HeliumHelium
Substrate
Column diameter (mm) 0.25 0.320.25
Phase thickness (μm) 0.25 0.251.00
Program 70 0C 5 0C/min -> 120 0C 10 0C/min -> 280 0C (20 min)not specifiednot specified40 0C 4 0C/min -> 230 0C 100 0C/min -> 260 0C (11.7 min)not specified
I 1189.1204.1214.1202.1204.
ReferencePurushothaman and Ravi, 2013VOC BinBase, 2012Kahriman, Tosun, et al., 2011Miyazaki, Plotto, et al., 2011Skogerson, Wohlgemuth, et al., 2011
Comment MSDC-RI MSDC-RI MSDC-RI MSDC-RI MSDC-RI
Column type CapillaryCapillaryCapillaryCapillaryCapillary
Active phase RTX-1BPX-5BPX-5BPX-5DB-5
Column length (m) 60.30.30.30.30.
Carrier gas HeliumHeliumHeliumHeliumHydrogen
Substrate
Column diameter (mm) 0.220.250.250.250.25
Phase thickness (μm) 0.250.250.250.250.25
Program not specified70 0C (1 min) 3 0C/min -> 142 0C 5 0C/min -> 225 0C (10 min)35 0C (5 min) 3 0C/min -> 210 0C 40 0C/min -> 240 0C (10 min)not specified35 0C (2 min) 4 0C/min -> 180 0C 20 0C -> 280 0C
I 1187.1215.1215.1210.1216.
ReferenceDib, Djabou, et al., 2010Ortiz, Echeverra, et al., 2009se Souza, Cardeal, et al., 2009se Souza, Cardeal, et al., 2009Pontes, de Oliveira, et al., 2007
Comment MSDC-RI MSDC-RI MSDC-RI MSDC-RI MSDC-RI
Column type CapillaryCapillaryCapillaryCapillaryCapillary
Active phase DB-5DB-5DB-5MSSE-30HP-5
Column length (m) 60.30.30. 30.
Carrier gas  HeHe
Substrate
Column diameter (mm) 0.250.250.25 0.25
Phase thickness (μm) 0.250.250.25 0.25
Program 50C => 5C/min => 100C => 15C/min => 250C (19C)40C(1min) => 9C/min => 130C => 2C/min => 230C40C => 2C/min => 60C => 4C/min => 260Cnot specified40C(6min) => 2.5C/min => 150C => 90C/min => 250C
I 1213.1220.1210.1193.1200.
ReferenceBeaulieu, 2005Hamm, Bleton, et al., 2005Maia, Andrade, et al., 2004Vinogradov, 2004Jordán, Margaría, et al., 2003
Comment MSDC-RI MSDC-RI MSDC-RI MSDC-RI MSDC-RI
Column type CapillaryCapillaryCapillaryCapillaryCapillary
Active phase OV-101DB-1HP-5HP-5OV-101
Column length (m)  30.30.30.50.
Carrier gas  He  N2
Substrate
Column diameter (mm)  0.250.250.250.25
Phase thickness (μm)  0.10.250.25
Program not specified35C => 4C/min => 180C => 10C/min => 250Cnot specifiednot specifiednot specified
I 1193.1204.1200.1205.1193.
ReferenceKrings, Banavara, et al., 2003Silva, Matos, et al., 2003Jordán, Goodner, et al., 2002Jordán, Goodner, et al., 2002Yang, 2001
Comment MSDC-RI MSDC-RI MSDC-RI MSDC-RI MSDC-RI
Column type CapillaryCapillaryCapillaryCapillary
Active phase DB-1DB-1OV-101OV-1, SE-30, Methyl silicone, SP-2100, OV-101, DB-1, etc.
Column length (m) 30.30.25.50.
Carrier gas H2H2HeHydrogen
Substrate
Column diameter (mm) 0.250.250.310.32
Phase thickness (μm) 0.250.25
Program 30C (2min) => 2C/min => 150C => 4C/min => 250C30C (2min) => 2C/min => 150C => 4C/min => 250Cnot specifiednot specified
I 1193.1193.1193.1200.
ReferenceTakeoka, Flath, et al., 1988Takeoka, Flath, et al., 1988Morales and Duque, 1987Waggott and Davies, 1984
Comment MSDC-RI MSDC-RI MSDC-RI MSDC-RI

References

Timmermans and Mattaar, 1921
Timmermans, J.; Mattaar, J.F.,
Freezing points of orgainic substances VI. New experimental determinations.,
Bull. Soc. Chim. Belg., 1921, 30, 213. [all data]
Krasnykh, Verevkin, et al., 2006
Krasnykh, Eugen L.; Verevkin, Sergey P.; Koutek, Bohumir; Doubsky, Jan,
Vapour pressures and enthalpies of vaporization of a series of the linear n-alkyl acetates,
The Journal of Chemical Thermodynamics, 2006, 38, 6, 717-723, https://doi.org/10.1016/j.jct.2005.08.003
. [all data]
Defibaugh, Carrillo-Nava, et al., 1997
Defibaugh, D.R.; Carrillo-Nava, E.; Hurly, J.J.; Moldover, M.R.; Schmidt, J.W.; Weber, L.A.,
Thermodynamic Properties of HFC-338mccq, CF 3 CF 2 CF 2 CH 2 F, 1,1,1,2,2,3,3,4-Octafluorobutane «8224»,
J. Chem. Eng. Data, 1997, 42, 3, 488-496, https://doi.org/10.1021/je9603133
. [all data]
Weast and Grasselli, 1989
CRC Handbook of Data on Organic Compounds, 2nd Editon, Weast,R.C and Grasselli, J.G., ed(s)., CRC Press, Inc., Boca Raton, FL, 1989, 1. [all data]
Stephenson and Malanowski, 1987
Stephenson, Richard M.; Malanowski, Stanislaw,
Handbook of the Thermodynamics of Organic Compounds, 1987, https://doi.org/10.1007/978-94-009-3173-2
. [all data]