trans-1,2-Cyclohexanediamine
- Formula: C6H14N2
- Molecular weight: 114.1888
- IUPAC Standard InChIKey: SSJXIUAHEKJCMH-WDSKDSINSA-N
- CAS Registry Number: 1121-22-8
- Chemical structure:
View 3d structure (requires JavaScript / HTML 5) - Stereoisomers:
- Other names: trans-1,2-Cyclohexaneiamine; 1,2-Cyclohexanediamine, trans-; trans-1,2-Diaminocyclohexane; 1,2-Cyclohexanediamine, (1R,2R)-rel-; (+-)trans-1,2-Diaminocyclohexane

Phase change data

Data compiled by: Robert L. Brown and Stephen E. Stein
Quantity | Value | Units | Method | Reference | Comment |
---|---|---|---|---|---|
Tboil | 461. | K | N/A | Frinton Laboratories Inc., 1986 |
Reduced pressure boiling point
Tboil (K) | Pressure (bar) | Reference |
---|---|---|
353.2 | 0.020 | Aldrich Chemical Company Inc., 1990 |

References

Frinton Laboratories Inc., 1986
Frinton Laboratories Inc.,
Catalog Number 11, Frinton Laboratories Inc., Vineland, NJ, 1986, 99. [all data]
Aldrich Chemical Company Inc., 1990
Aldrich Chemical Company Inc.,
Catalog Handbook of Fine Chemicals, Aldrich Chemical Company, Inc., Milwaukee WI, 1990, 1. [all data]