Cyclohexane, 1,2-dichloro-
- Formula: C6H10Cl2
- Molecular weight: 153.050
- IUPAC Standard InChIKey: GZEZIBFVJYNETN-UHFFFAOYSA-N
- CAS Registry Number: 1121-21-7
- Chemical structure:
View 3d structure (requires JavaScript / HTML 5) - Stereoisomers:
- Other names: 1,2-Dichlorocyclohexane

Kovats' RI, polar column, isothermal

Column type | Active phase | Temperature (C) | I | Reference | Comment |
---|---|---|---|---|---|
Packed | Carbowax 20M | 140. | 1416. | Szabó and Jánosi, 1979 | Ar, Chromosorb W; Column length: 1.5 m |

References

Szabó and Jánosi, 1979
Szabó, M.; Jánosi, A.,
Gas chromatographic separation and determination of the components of competitive chlorination reaction mixtures of heptene-1 and cyclohexene,
J. Chromatogr., 1979, 170, 1, 240-244, https://doi.org/10.1016/S0021-9673(00)84259-4
. [all data]