1,2-Oxathiolane, 2,2-dioxide
- Formula: C3H6O3S
- Molecular weight: 122.143
- IUPAC Standard InChIKey: FSSPGSAQUIYDCN-UHFFFAOYSA-N
- CAS Registry Number: 1120-71-4
- Chemical structure:
View 3d structure (requires JavaScript / HTML 5) - Other names: γ-Propane sultone; Propane sultone; 1-Propanesulfonic acid, 3-hydroxy-, γ-sultone; 1,3-Propane sultone; 3-Hydroxy-1-propanesulfonic acid, sultone; 3-Hydroxy-1-propanesulfonic acid γ-sultone; 3-Hydroxy-1-propanesulphonic acid sultone; Rcra waste number U193; NSC 42386

Phase change data

Data compiled by: Thermodynamics Research Center, NIST Boulder Laboratories, Chris Muzny director
Quantity | Value | Units | Method | Reference | Comment |
---|---|---|---|---|---|
Tfus | 304.33 | K | N/A | Donnelly, Drewes, et al., 1990 | Uncertainty assigned by TRC = 0.2 K |

References

Donnelly, Drewes, et al., 1990
Donnelly, J.R.; Drewes, L.A.; Johnson, R.L.; Munslow, W.D.; Knapp, K.K.; Sovocool, G.W.,
Purity and heat of fusion data for environmental standards as determined by differential scanning calorimetry,
Thermochim. Acta, 1990, 167, 2, 155, https://doi.org/10.1016/0040-6031(90)80476-F
. [all data]