Acetic acid, heptyl ester
- Formula: C9H18O2
- Molecular weight: 158.2380
- IUPAC Standard InChIKey: ZCZSIDMEHXZRLG-UHFFFAOYSA-N
- CAS Registry Number: 112-06-1
- Chemical structure:
View 3d structure (requires JavaScript / HTML 5) - Other names: n-Heptyl acetate; Heptyl acetate; 1-Heptyl acetate; Heptanyl acetate; Acetic acid n-heptyl ester; n-Heptyl ethanoate; Acetate C-7; Heptanol acetate

Phase change data

Data compiled as indicated in comments:
TRC - Thermodynamics Research Center, NIST Boulder Laboratories, Chris Muzny director
AC - William E. Acree, Jr., James S. Chickos
Quantity | Value | Units | Method | Reference | Comment |
---|---|---|---|---|---|
Tboil | 501. | K | N/A | Nayanov, Zorin, et al., 1976 | Uncertainty assigned by TRC = 3. K; TRC |
Tboil | 464. | K | N/A | Engelhard, Schilfarth, et al., 1949 | Uncertainty assigned by TRC = 3. K; TRC |
Tboil | 465.60 | K | N/A | Bilterys and Gisseleire, 1935 | Uncertainty assigned by TRC = 0.3 K; TRC |
Tboil | 464.5 | K | N/A | Gartenmeister, 1886 | Uncertainty assigned by TRC = 1.5 K; TRC |
Quantity | Value | Units | Method | Reference | Comment |
Tfus | 223.0 | K | N/A | Bilterys and Gisseleire, 1935 | Uncertainty assigned by TRC = 0.5 K; TRC |
Quantity | Value | Units | Method | Reference | Comment |
ΔvapH° | 57.1 ± 0.2 | kJ/mol | GS | Krasnykh, Verevkin, et al., 2006 | Based on data from 274. to 306. K.; AC |
ΔvapH° | 56.9 | kJ/mol | GC | Koutek, Hoskovec, et al., 1997 | AC |
Enthalpy of vaporization
ΔvapH (kJ/mol) | Temperature (K) | Method | Reference | Comment |
---|---|---|---|---|
49.2 | 402. | DTA | Meyer, Awe, et al., 1980 | Based on data from 387. to 478. K.; AC |

Kovats' RI, polar column, temperature ramp

Data compiled by: NIST Mass Spectrometry Data Center, William E. Wallace, director

Column type CapillaryCapillaryCapillaryCapillary
Active phase SupelcowaxDB-WaxCarbowax 20MCarbowax 20M
Column length (m) 30.60.150.50.
Carrier gas  HeHeHe
Substrate
Column diameter (mm) 0.250.250.640.28
Phase thickness (μm) 0.25
Tstart (C) 60.40.50.70.
Tend (C) 240.200.170.190.
Heat rate (K/min) 3.2.1.2.
Initial hold (min) 5.2.
Final hold (min) 10.
I 1361.1374.1370.1366.
ReferenceRiu-Aumatell, Castellari, et al., 2004Umano, Hagi, et al., 1994Buttery, Seifert, et al., 1982Tressl, Friese, et al., 1978
Comment MSDC-RI MSDC-RI MSDC-RI MSDC-RI

Kovats' RI, non-polar column, temperature ramp

Data compiled by: NIST Mass Spectrometry Data Center, William E. Wallace, director

Column type CapillaryCapillaryCapillaryCapillaryCapillary
Active phase DB-1DB-1DB-1DB-1OV-101
Column length (m) 60.60.60.60.50.
Carrier gas HeHeHeHe
Substrate
Column diameter (mm) 0.320.320.320.320.23
Phase thickness (μm) 0.250.250.250.25
Tstart (C) 30.30.30.30.80.
Tend (C) 210.210.210.210.200.
Heat rate (K/min) 2.2.2.2.2.
Initial hold (min) 4.4.4.4.
Final hold (min)
I 1096.1094.1096.1096.1093.
ReferenceTakeoka, Buttery, et al., 1992Takeoka, Buttery, et al., 1992Takeoka, Buttery, et al., 1992Takeoka, Buttery, et al., 1992Ohnishi and Shibamoto, 1984
Comment MSDC-RI MSDC-RI MSDC-RI MSDC-RI MSDC-RI
Column type Capillary
Active phase OV-101
Column length (m) 50.
Carrier gas
Substrate
Column diameter (mm) 0.23
Phase thickness (μm)
Tstart (C) 80.
Tend (C) 200.
Heat rate (K/min) 2.
Initial hold (min)
Final hold (min)
I 1096.
ReferenceOhnishi and Shibamoto, 1984
Comment MSDC-RI

Van Den Dool and Kratz RI, non-polar column, temperature ramp

Data compiled by: NIST Mass Spectrometry Data Center, William E. Wallace, director

Column type CapillaryCapillaryCapillaryCapillaryCapillary
Active phase 5 % Phenyl methyl siloxaneHP-5Mega 5MSDB-5HP-5
Column length (m) 30.30.30.30.30.
Carrier gas  N2HeHeHe
Substrate
Column diameter (mm) 0.250.250.250.250.25
Phase thickness (μm) 0.250.250.25
Tstart (C) 60.60.40.50.50.
Tend (C) 270.220.240.250.200.
Heat rate (K/min) 15.5.3.3.4.
Initial hold (min)  10.2. 1.
Final hold (min) 15.
I 1120.1115.1111.1113.1112.
ReferenceZaikin, 2010Flamini, Tebano, et al., 2006Verzera, Trozzi, et al., 2003Isidorov, Zenkevich, et al., 2001Shalit, Katzir, et al., 2001
Comment MSDC-RI MSDC-RI MSDC-RI MSDC-RI MSDC-RI
Column type CapillaryCapillaryCapillaryCapillaryCapillary
Active phase DB-1Mega 5MSOV-101OV-101DB-5
Column length (m) 30.30.50.50.0.32
Carrier gas H2HeN2N2H2
Substrate
Column diameter (mm) 0.320.250.250.251.
Phase thickness (μm) 0.250.25
Tstart (C) 40.40.80.80.30.
Tend (C) 245.240.200.200.180.
Heat rate (K/min) 3.3.2.2.1.5
Initial hold (min) 3.2.  5.
Final hold (min) 20.
I 1085.1111.1090.1094.1115.
ReferenceBrat, Brillouet, et al., 2000Verzera, la Rosa, et al., 2000Yang, Sugisawa, et al., 1992Yang, Sugisawa, et al., 1992Guichard and Souty, 1988
Comment MSDC-RI MSDC-RI MSDC-RI MSDC-RI MSDC-RI
Column type Packed
Active phase SE-30
Column length (m)
Carrier gas
Substrate Celite
Column diameter (mm)
Phase thickness (μm)
Tstart (C) 75.
Tend (C) 228.
Heat rate (K/min)
Initial hold (min)
Final hold (min)
I 1096.
Referencevan den Dool and Kratz, 1963
Comment MSDC-RI

Kovats' RI, non-polar column, isothermal

Data compiled by: NIST Mass Spectrometry Data Center, William E. Wallace, director

Column type CapillaryCapillaryCapillaryCapillaryCapillary
Active phase DB-1DB-5SE-30SE-30SE-30
Column length (m) 30.60.  25.
Carrier gas N2N2  N2
Substrate
Column diameter (mm) 0.2560.321  0.33
Phase thickness (μm) 0.250.25
Temperature (C) 80.80.100.120.100.
I 1089.151110.211095.1070.1095.
ReferenceMijin and Antonovic, 2006Mijin and Antonovic, 2006Tarjan, Nyiredy, et al., 1989Tarjan, Nyiredy, et al., 1989Haken and Korhonen, 1986
Comment MSDC-RI MSDC-RI MSDC-RI MSDC-RI MSDC-RI
Column type CapillaryCapillaryCapillaryCapillaryCapillary
Active phase SE-30SE-30SE-30SE-30SE-30
Column length (m) 25.25.25.25.25.
Carrier gas N2N2N2N2
Substrate
Column diameter (mm) 0.330.330.330.330.22
Phase thickness (μm)
Temperature (C) 120.140.160.180.100.
I 1070.1086.1090.1093.1099.
ReferenceHaken and Korhonen, 1986Haken and Korhonen, 1986Haken and Korhonen, 1986Haken and Korhonen, 1986Haken, Madden, et al., 1983
Comment MSDC-RI MSDC-RI MSDC-RI MSDC-RI MSDC-RI
Column type CapillaryCapillaryCapillaryPackedPacked
Active phase SE-30SE-30OV-101SE-30SE-30
Column length (m) 25.25.15.2.2.
Carrier gas   N2
Substrate    Chromosorb WChromosorb W
Column diameter (mm) 0.220.220.22
Phase thickness (μm)
Temperature (C) 140.180.200.100.140.
I 1083.1083.1091.71095.1095.
ReferenceHaken, Madden, et al., 1983Haken, Madden, et al., 1983Komárek, Hornová, et al., 1982Zarazir, Chovin, et al., 1970Zarazir, Chovin, et al., 1970
Comment MSDC-RI MSDC-RI MSDC-RI MSDC-RI MSDC-RI

Normal alkane RI, non-polar column, temperature ramp

Data compiled by: NIST Mass Spectrometry Data Center, William E. Wallace, director

Column type CapillaryCapillaryCapillaryCapillaryCapillary
Active phase DB-1OV-101HP-5DB-5 MSOV-101
Column length (m) 60.50. 30.50.
Carrier gas HeN2 Helium
Substrate
Column diameter (mm) 0.250.25 0.250.25
Phase thickness (μm) 0.25
Tstart (C) 70.80.35.50.80.
Tend (C) 230.200.200.250.200.
Heat rate (K/min) 2.2.6.4.2.
Initial hold (min) 2. 2.
Final hold (min) 20.
I 1111.1090.1110.1110.1090.
ReferenceChoi, 2003Yang, 2001Larsen and Frisvad, 1995Gomez and Ledbetter, 1994Tamura, Yang, et al., 1993
Comment MSDC-RI MSDC-RI MSDC-RI MSDC-RI MSDC-RI
Column type CapillaryCapillary
Active phase OV-101OV-1
Column length (m) 50.183.
Carrier gas  N2
Substrate
Column diameter (mm) 0.250.762
Phase thickness (μm)
Tstart (C) 80.0.
Tend (C) 200.230.
Heat rate (K/min) 2.1.
Initial hold (min)
Final hold (min)
I 1094.1090.
ReferenceTamura, Yang, et al., 1993Schreyen, Dirinck, et al., 1979
Comment MSDC-RI MSDC-RI

References

Nayanov, Zorin, et al., 1976
Nayanov, V.P.; Zorin, V.V.; Zlotskii, S.S.; Rakhmankulov, D.L.,
Identification of Cyclic Acetates and Isomeric Esters by Gas-Liquid Chromatography,
Zh. Prikl. Khim. (Leningrad), 1976, 49, 2350. [all data]
Engelhard, Schilfarth, et al., 1949
Engelhard, H.; Schilfarth, H.; Kaul, H.G.,
The Surface Tension of Aliphatic Oxyesters,
Justys Liebigs Ann. Chem., 1949, 563, 239-44. [all data]
Bilterys and Gisseleire, 1935
Bilterys, R.; Gisseleire, J.,
Investigations on the Congelation Temperature of Organic Compounds,
Bull. Soc. Chim. Belg., 1935, 44, 567. [all data]
Gartenmeister, 1886
Gartenmeister, R.,
Investigation of the physical characterstics of liquid compounds: vi boiling point and specific volume of normal fatty acid esters,
Justus Liebigs Ann. Chem., 1886, 233, 249-315. [all data]
Krasnykh, Verevkin, et al., 2006
Krasnykh, Eugen L.; Verevkin, Sergey P.; Koutek, Bohumir; Doubsky, Jan,
Vapour pressures and enthalpies of vaporization of a series of the linear n-alkyl acetates,
The Journal of Chemical Thermodynamics, 2006, 38, 6, 717-723, https://doi.org/10.1016/j.jct.2005.08.003
. [all data]
Koutek, Hoskovec, et al., 1997
Koutek, Bohumír; Hoskovec, Michal; Vrkocová, Pavlína; Feltl, Ladislav,
Gas chromatographic determination of vapour pressures of pheromone-like compounds IV. Acetates, a reinvestigation,
Journal of Chromatography A, 1997, 759, 1-2, 93-109, https://doi.org/10.1016/S0021-9673(96)00775-3
. [all data]
Meyer, Awe, et al., 1980
Meyer, Edwin F.; Awe, Michael J.; Wagner, Robert E.,
Cohesive energies in polar organic liquids. 4. n-Alkyl acetates,
J. Chem. Eng. Data, 1980, 25, 4, 371-374, https://doi.org/10.1021/je60087a030
. [all data]