di-n-Decylamine
- Formula: C20H43N
- Molecular weight: 297.5621
- IUPAC Standard InChIKey: GMTCPFCMAHMEMT-UHFFFAOYSA-N
- CAS Registry Number: 1120-49-6
- Chemical structure:
View 3d structure (requires JavaScript / HTML 5) - Other names: Didecylamine; 1-Decanamine, N-decyl-; Armeen 2-10; Radiamine 6310

Phase change data

Data compiled as indicated in comments:
TRC - Thermodynamics Research Center, NIST Boulder Laboratories, Chris Muzny director
BS - Robert L. Brown and Stephen E. Stein
AC - William E. Acree, Jr., James S. Chickos
Quantity | Value | Units | Method | Reference | Comment |
---|---|---|---|---|---|
Tboil | 637.15 | K | N/A | Sudaricov, Phrolov, et al., 1963 | Uncertainty assigned by TRC = 3. K; TRC |
Quantity | Value | Units | Method | Reference | Comment |
Tfus | 315. ± 10. | K | AVG | N/A | Average of 7 values; Individual data points |
Reduced pressure boiling point
Tboil (K) | Pressure (atm) | Reference | Comment |
---|---|---|---|
452.7 | 0.003 | Aldrich Chemical Company Inc., 1990 | BS |
Enthalpy of vaporization
ΔvapH (kcal/mol) | Temperature (K) | Method | Reference | Comment |
---|---|---|---|---|
16.9 | 521. | A | Stephenson and Malanowski, 1987 | Based on data from 506. to 705. K.; AC |

Normal alkane RI, non-polar column, temperature ramp

View large format table.

Column type Active phase I Reference Comment
CapillaryUltra-12142.Okumura, 199125. m/0.32 mm/0.25 μm, He, 3. K/min; Tstart: 80. C; Tend: 260. C

References

Sudaricov, Phrolov, et al., 1963
Sudaricov, B.N.; Phrolov, U.G.; Ilichev, V.A.I.; Pushcov, A.A.; Zaharov-Narcissov, O.I.; Ochkin, A.B.,
Physicochemical Properties of Certain n-Aliphatic Amines,
Tr. Inst. - Mosk. Khim. -Tekhnol. Inst. im. D. I. Mendele- eva, 1963, 43, 21. [all data]
Aldrich Chemical Company Inc., 1990
Aldrich Chemical Company Inc.,
Catalog Handbook of Fine Chemicals, Aldrich Chemical Company, Inc., Milwaukee WI, 1990, 1. [all data]
Stephenson and Malanowski, 1987
Stephenson, Richard M.; Malanowski, Stanislaw,
Handbook of the Thermodynamics of Organic Compounds, 1987, https://doi.org/10.1007/978-94-009-3173-2
. [all data]