1-Octanamine, n-octyl-
- Formula: C16H35N
- Molecular weight: 241.4558
- IUPAC Standard InChIKey: LAWOZCWGWDVVSG-UHFFFAOYSA-N
- CAS Registry Number: 1120-48-5
- Chemical structure:
View 3d structure (requires JavaScript / HTML 5) - Other names: Dioctylamine; Di-n-octylamine; Rc 5632; di-Normal-octylamine; N-n-Octyl-n-octylamine

Gas phase thermochemistry data

Data compiled by: Hussein Y. Afeefy, Joel F. Liebman, and Stephen E. Stein
Quantity | Value | Units | Method | Reference | Comment |
---|---|---|---|---|---|
ΔfH°gas | -76.53 ± 0.55 | kcal/mol | Ccr | Steele, Chirico, et al., 1996 |

Condensed phase thermochemistry data

Data compiled as indicated in comments:
ALS - Hussein Y. Afeefy, Joel F. Liebman, and Stephen E. Stein
DH - Eugene S. Domalski and Elizabeth D. Hearing
Quantity | Value | Units | Method | Reference | Comment |
---|---|---|---|---|---|
ΔfH°liquid | -97.35 ± 0.45 | kcal/mol | Ccr | Steele, Chirico, et al., 1996 | ALS |
Quantity | Value | Units | Method | Reference | Comment |
ΔcH°liquid | -2602.99 ± 0.38 | kcal/mol | Ccr | Steele, Chirico, et al., 1996 | ALS |
Constant pressure heat capacity of liquid
Cp,liquid (cal/mol*K) | Temperature (K) | Reference | Comment |
---|---|---|---|
121.2 | 298.15 | Steele, Chirico, et al., 1993 | DH |

Phase change data

Data compiled as indicated in comments:
BS - Robert L. Brown and Stephen E. Stein
TRC - Thermodynamics Research Center, NIST Boulder Laboratories, Chris Muzny director
ALS - Hussein Y. Afeefy, Joel F. Liebman, and Stephen E. Stein
DRB - Donald R. Burgess, Jr.
AC - William E. Acree, Jr., James S. Chickos
Quantity | Value | Units | Method | Reference | Comment |
---|---|---|---|---|---|
Tboil | 570.7 | K | N/A | Aldrich Chemical Company Inc., 1990 | BS |
Tboil | 570.65 | K | N/A | Merz and Gasiorowski, 1884 | Uncertainty assigned by TRC = 7. K; TRC |
Quantity | Value | Units | Method | Reference | Comment |
Tfus | 300. ± 20. | K | AVG | N/A | Average of 9 values; Individual data points |
Quantity | Value | Units | Method | Reference | Comment |
Tc | 734. | K | N/A | Steele, Chirico, et al., 1996, 2 | Uncertainty assigned by TRC = 3. K; fitting parameter in Wagner equation for vapor pressure; TRC |
Quantity | Value | Units | Method | Reference | Comment |
Pc | 12.44 | atm | N/A | Steele, Chirico, et al., 1996, 2 | Uncertainty assigned by TRC = 2.96 atm; from extrapolation of obs. vapor pressure to Tc; TRC |
Quantity | Value | Units | Method | Reference | Comment |
ρc | 0.915 | mol/l | N/A | Steele, Chirico, et al., 1996, 2 | Uncertainty assigned by TRC = 0.083 mol/l; TRC |
Quantity | Value | Units | Method | Reference | Comment |
ΔvapH° | 20.82 ± 0.32 | kcal/mol | V | Steele, Chirico, et al., 1996 | ALS |
ΔvapH° | 20.8 | kcal/mol | N/A | Steele, Chirico, et al., 1996 | DRB |
ΔvapH° | 20.8 ± 0.31 | kcal/mol | EB | Steele, Chirico, et al., 1996 | Based on data from 448. to 597. K.; AC |

References

Steele, Chirico, et al., 1996
Steele, W.V.; Chirico, R.D.; Knipmeyer, S.E.; Nguyen, A.; Smith, N.K.; Tasker, I.R.,
Thermodynamic properties and ideal-gas enthalpies of formation for cyclohexene, phthalan (2,5-dihydrobenzo-3,4-furan), isoxazole, octylamine, dioctylamine, trioctylamine, phenyl isocyanate, and 1,4,5,6-tetrahydropyrimidine,
J. Chem. Eng. Data, 1996, 41, 1269-1284. [all data]
Steele, Chirico, et al., 1993
Steele, W.V.; Chirico, R.D.; Knipmeyer, S.E.; Nguyen, A.; Tasker, I.R.,
Determination of ideal gas enthalpies of formation for key compounds the 1991 project results,
DIPPR Project, 1993, 871, NIPER-716. [all data]
Aldrich Chemical Company Inc., 1990
Aldrich Chemical Company Inc.,
Catalog Handbook of Fine Chemicals, Aldrich Chemical Company, Inc., Milwaukee WI, 1990, 1. [all data]
Merz and Gasiorowski, 1884
Merz, V.; Gasiorowski, K.,
Chem. Ber., 1884, 17, 623. [all data]
Steele, Chirico, et al., 1996, 2
Steele, W.V.; Chirico, R.D.; Knipmeyer, S.E.; Nguyen, A.; Smith, N.K.; Tasker, I.R.,
Thermodynamic Properties and Ideal-Gas Enthalpies of Formation for Dioctylamine, trioctylamine, Phenyl Isocyanate, and 1,4,5,6-Tetrahydropyrimidine,
J. Chem. Eng. Data, 1996, 41, 1269-84. [all data]