9-Hexadecenoic acid, methyl ester, (Z)-
- Formula: C17H32O2
- Molecular weight: 268.4348
- IUPAC Standard InChIKey: IZFGRAGOVZCUFB-HJWRWDBZSA-N
- CAS Registry Number: 1120-25-8
- Chemical structure:
View 3d structure (requires JavaScript / HTML 5) - Stereoisomers:
- Other names: Methyl palmitoleate; Methyl palmitoleinate; Palmitoleic acid, methyl ester; cis-9-Hexadecenoic acid, methyl ester; Methyl Z-9-hexadecenoate; Methyl cis-hexadec-9-enoate; Methyl 9-hexadecenoate (Methyl palmitoleate); methyl palmitioleate; methyl (Z)-hexadec-9-enoate

Condensed phase thermochemistry data

Data compiled by: Hussein Y. Afeefy, Joel F. Liebman, and Stephen E. Stein
Quantity | Value | Units | Method | Reference | Comment |
---|---|---|---|---|---|
ΔfH°liquid | -674.29 | kJ/mol | Chyd | Rogers and Siddiqui, 1975 | |
Quantity | Value | Units | Method | Reference | Comment |
ΔcH°liquid | -10547.9 ± 1.5 | kJ/mol | Ccb | Freedman, Bagby, et al., 1989 | Corresponding ΔfHºliquid = -715.09 kJ/mol (simple calculation by NIST; no Washburn corrections) |

Phase change data

Data compiled as indicated in comments:
BS - Robert L. Brown and Stephen E. Stein
AC - William E. Acree, Jr., James S. Chickos
Quantity | Value | Units | Method | Reference | Comment |
---|---|---|---|---|---|
ΔvapH° | 96.4 ± 0.7 | kJ/mol | CGC | Lipkind, Kapustin, et al., 2007 | AC |
Reduced pressure boiling point
Tboil (K) | Pressure (bar) | Reference | Comment |
---|---|---|---|
454.7 | 0.001 | Aldrich Chemical Company Inc., 1990 | BS |

Reaction thermochemistry data

Data compiled by: Hussein Y. Afeefy, Joel F. Liebman, and Stephen E. Stein
Individual Reactions
By formula: C17H32O2 + H2 = C17H34O2
Quantity | Value | Units | Method | Reference | Comment |
---|---|---|---|---|---|
ΔrH° | -29.30 ± 0.24 | kcal/mol | Chyd | Rogers and Siddiqui, 1975 | liquid phase; solvent: n-Hexane |

Kovats' RI, non-polar column, isothermal

Column type | Active phase | Temperature (C) | I | Reference | Comment |
---|---|---|---|---|---|
Capillary | CP Sil 5 CB | 240. | 1884. | Hanai and Hong, 1989 | 30. m/0.25 mm/0.25 μm |
Capillary | DB-1 | 240. | 1896. | Hanai and Hong, 1989 | 30. m/0.25 mm/0.25 μm |
Packed | SE-30 | 200. | 1888. | Golovnya and Kuzmenko, 1977 | He, Chromosorb W (80-100 mesh); Column length: 1.5 m |

Kovats' RI, polar column, isothermal

Column type | Active phase | Temperature (C) | I | Reference | Comment |
---|---|---|---|---|---|
Capillary | CP-Wax | 240. | 2242. | Hanai and Hong, 1989 | 25. m/0.25 mm/0.22 μm |
Capillary | DB-Wax | 240. | 2277. | Hanai and Hong, 1989 | 25. m/0.25 mm/0.22 μm |

Van Den Dool and Kratz RI, non-polar column, temperature ramp

Column type | Active phase | I | Reference | Comment |
---|---|---|---|---|
Capillary | HP-5MS | 1932. | Pino, Mesa, et al., 2005 | 30. m/0.25 mm/0.25 μm, He, 60. C @ 2. min, 4. K/min, 250. C @ 20. min |
Capillary | SPB-5 | 1912. | Píno, Marbot, et al., 2004 | 30. m/0.25 mm/0.25 μm, He, 60. C @ 2. min, 4. K/min, 250. C @ 20. min |
Capillary | Ultra-1 | 1885.86 | Richmond and Pombo-Villar, 1997 | 25. m/0.32 mm/0.52 μm, 15. K/min, 320. C @ 10. min; Tstart: 35. C |
Capillary | BP-1 | 1881. | Tan, Wilkins, et al., 1989 | H2, 40. C @ 2. min, 4. K/min, 240. C @ 75. min; Column length: 12. m |

Van Den Dool and Kratz RI, non-polar column, custom temperature program

Column type | Active phase | I | Reference | Comment |
---|---|---|---|---|
Capillary | VF-5MS | 1911.7 | Tret'yakov, 2007 | 30. m/0.25 mm/0.25 μm, He; Program: Multi-step temperature program; T(initial)=60C; T(final)=270C |

Van Den Dool and Kratz RI, polar column, temperature ramp

Column type | Active phase | I | Reference | Comment |
---|---|---|---|---|
Capillary | AT-Wax | 2225. | Pino, Almora, et al., 2003 | 60. m/0.32 mm/0.25 μm, He, 65. C @ 10. min, 2. K/min, 250. C @ 60. min |

Normal alkane RI, non-polar column, temperature ramp

Column type | Active phase | I | Reference | Comment |
---|---|---|---|---|
Capillary | DB-5 | 1879. | Pattiram, Lasekan, et al., 2011 | 30. m/0.32 mm/0.25 μm, Helium, 2. K/min; Tstart: 35. C; Tend: 200. C |
Capillary | RTx-1 | 1895. | Dib, Bendahou, et al., 2010 | 60. m/0.22 mm/0.25 μm, Helium, 2. K/min, 230. C @ 35. min; Tstart: 60. C |
Capillary | HP-5 | 1890. | N/A | 30. m/0.32 mm/0.25 μm, Helium, 40. C @ 2. min, 5. K/min, 250. C @ 5. min |
Capillary | Ultra-1 | 1882. | Okumura, 1991 | 25. m/0.32 mm/0.25 μm, He, 3. K/min; Tstart: 80. C; Tend: 260. C |
Capillary | OV-101 | 1886. | Ehrhardt, Osterroht, et al., 1980 | Hydrogen, 60. C @ 0.5 min, 4. K/min; Column length: 30. m; Column diameter: 0.35 mm; Tend: 270. C |

Normal alkane RI, non-polar column, custom temperature program

Column type | Active phase | I | Reference | Comment |
---|---|---|---|---|
Capillary | RTx-1 | 1889. | Dib, Bendahou, et al., 2010 | 60. m/0.22 mm/0.25 μm, Helium; Program: not specified |

Normal alkane RI, polar column, temperature ramp

Column type | Active phase | I | Reference | Comment |
---|---|---|---|---|
Capillary | ZB-Wax | 2236. | N/A | 30. m/0.32 mm/0.25 μm, Helium, 40. C @ 2. min, 5. K/min, 250. C @ 5. min |
Capillary | ZB-Wax | 2237. | N/A | 30. m/0.32 mm/0.25 μm, Helium, 40. C @ 2. min, 5. K/min, 250. C @ 5. min |
Capillary | TC-Wax | 2245. | Shuichi, Masazumi, et al., 1996 | 80. C @ 5. min, 3. K/min; Column length: 60. m; Column diameter: 0.25 mm; Tend: 240. C |

References

Rogers and Siddiqui, 1975
Rogers, D.W.; Siddiqui, N.A.,
Heats of hydrogenation of large molecules. I. Esters of unsaturated fatty acids,
J. Phys. Chem., 1975, 79, 574-577. [all data]
Freedman, Bagby, et al., 1989
Freedman, B.; Bagby, M.O.; Khoury, H.,
Correlation of heats of combustion with empirical formulas for fatty alcohols,
J. Am. Oil Chem. Soc., 1989, 66, 595-596. [all data]
Lipkind, Kapustin, et al., 2007
Lipkind, Dmitry; Kapustin, Yaroslav; Umnahanant, Patamaporn; Chickos, James S.,
The vaporization enthalpies and vapor pressures of a series of unsaturated fatty acid methyl esters by correlation gas chromatography,
Thermochimica Acta, 2007, 456, 2, 94-101, https://doi.org/10.1016/j.tca.2007.02.008
. [all data]
Aldrich Chemical Company Inc., 1990
Aldrich Chemical Company Inc.,
Catalog Handbook of Fine Chemicals, Aldrich Chemical Company, Inc., Milwaukee WI, 1990, 1. [all data]