1,2-Decanediol
- Formula: C10H22O2
- Molecular weight: 174.2805
- IUPAC Standard InChIKey: YSRSBDQINUMTIF-UHFFFAOYSA-N
- CAS Registry Number: 1119-86-4
- Chemical structure:
View 3d structure (requires JavaScript / HTML 5) - Other names: decane-1,2-diol

Phase change data

Data compiled as indicated in comments:
BS - Robert L. Brown and Stephen E. Stein
TRC - Thermodynamics Research Center, NIST Boulder Laboratories, Chris Muzny director
Quantity | Value | Units | Method | Reference | Comment |
---|---|---|---|---|---|
Tboil | 528.2 | K | N/A | Aldrich Chemical Company Inc., 1990 | BS |
Quantity | Value | Units | Method | Reference | Comment |
Tfus | 321.65 | K | N/A | Swern, Billen, et al., 1946 | Uncertainty assigned by TRC = 0.3 K; TRC |

Van Den Dool and Kratz RI, non-polar column, custom temperature program

Column type | Active phase | I | Reference | Comment |
---|---|---|---|---|
Capillary | DB-1 | 1419. | Peng, 2000 | 15. m/0.53 mm/1. μm, He; Program: 40C(3min) => 8C/min => 200(1min) => 5C/min => 300C(25min) |

References

Aldrich Chemical Company Inc., 1990
Aldrich Chemical Company Inc.,
Catalog Handbook of Fine Chemicals, Aldrich Chemical Company, Inc., Milwaukee WI, 1990, 1. [all data]
Swern, Billen, et al., 1946
Swern, D.; Billen, N.; Scanlan, J.T.,
Hydroxylation and Epoxidation of SOme 1-Olefins with Per-acids,
J. Am. Chem. Soc., 1946, 68, 1504. [all data]
Peng, 2000
Peng, C.T.,
Prediction of retention indices. V. Influence of electronic effects and column polarity on retention index,
J. Chromatogr. A, 2000, 903, 1-2, 117-143, https://doi.org/10.1016/S0021-9673(00)00901-8
. [all data]