Propanenitrile, 3,3'-thiobis-
- Formula: C6H8N2S
- Molecular weight: 140.206
- IUPAC Standard InChIKey: NDVLTZFQVDXFAN-UHFFFAOYSA-N
- CAS Registry Number: 111-97-7
- Chemical structure:
View 3d structure (requires JavaScript / HTML 5) - Other names: Propionitrile, 3,3'-thiodi-; β,β'-Dicyanodiethyl sulfide; β,β'-Thiodipropionitrile; Bis(2-cyanoethyl) sulfide; Di(2-cyanoethyl) sulfide; Dicyanoethyl sulfide; Sulfide, bis(2-cyanoethyl); Thiodipropionitrile; 2-Cyanoethyl sulfide; 3,3'-Thiodipropionitrile; Thiobis(2-cyanoethane); 2-Cyanoethyl thioether; Nitril kyseliny β,β'-thiodipropionove; USAF HA-5; 2,2'-Thiodiethylkyanid; Bis-(2-cyanoethyl) sulphide; beta,beta'-Thiodipropionitrile; NSC 2040; 3,3'-thiodipropiononitrile

Condensed phase thermochemistry data

Data compiled by: Hussein Y. Afeefy, Joel F. Liebman, and Stephen E. Stein
Quantity | Value | Units | Method | Reference | Comment |
---|---|---|---|---|---|
ΔfH°liquid | 96.3 ± 5.0 | kJ/mol | Cm | Gladstone and Chang, 1966 | Heat of formation derived by Cox and Pilcher, 1970 |

Phase change data

Data compiled by: Thermodynamics Research Center, NIST Boulder Laboratories, Chris Muzny director
Quantity | Value | Units | Method | Reference | Comment |
---|---|---|---|---|---|
Tfus | 301.75 | K | N/A | Gladstone and Chang, 1966, 2 | Uncertainty assigned by TRC = 0.3 K |
Tfus | 301.7 | K | N/A | Witschonke, 1954 | Uncertainty assigned by TRC = 0.2 K |
Tfus | 301.8 | K | N/A | Witschonke, 1954 | Uncertainty assigned by TRC = 0.15 K |
Tfus | 295.25 | K | N/A | Witschonke, 1954 | Metastable crystal phase; Uncertainty assigned by TRC = 0.3 K |

Reaction thermochemistry data

Data compiled by: Hussein Y. Afeefy, Joel F. Liebman, and Stephen E. Stein
Individual Reactions
+ 2
= 2
+ ammonium sulphide
By formula: C6H8N2S + 2H3N = 2C3H3N + ammonium sulphide
Quantity | Value | Units | Method | Reference | Comment |
---|---|---|---|---|---|
ΔrH° | 126.4 ± 2.5 | kJ/mol | Cm | Gladstone and Chang, 1966 | liquid phase; Heat of formation derived by Cox and Pilcher, 1970 |
2 + ammonium sulphide =
+ 2
By formula: 2C3H3N + ammonium sulphide = C6H8N2S + 2H3N
Quantity | Value | Units | Method | Reference | Comment |
---|---|---|---|---|---|
ΔrH° | -126.4 ± 2.5 | kJ/mol | Cm | Gladstone and Chang, 1966 | liquid phase |

References

Gladstone and Chang, 1966
Gladstone, S.; Chang, H.Y.,
Determination of the standard heat of formation of 3,3'-thiodipropionitrile,
J. Chem. Eng. Data, 1966, 11, 238-239. [all data]
Cox and Pilcher, 1970
Cox, J.D.; Pilcher, G.,
Thermochemistry of Organic and Organometallic Compounds, Academic Press, New York, 1970, 1-636. [all data]
Gladstone and Chang, 1966, 2
Gladstone, S.; Chang, H.-Y.,
Det. of the Standard Heat of Formation of 3,3'-Thiodipropionitrile,
J. Chem. Eng. Data, 1966, 11, 238. [all data]
Witschonke, 1954
Witschonke, C.R.,
Freezing point and purity data for some organic compounds,
Anal. Chem., 1954, 26, 562-4. [all data]