Acetamide, N-butyl-
- Formula: C6H13NO
- Molecular weight: 115.1735
- IUPAC Standard InChIKey: GYLDXXLJMRTVSS-UHFFFAOYSA-N
- CAS Registry Number: 1119-49-9
- Chemical structure:
View 3d structure (requires JavaScript / HTML 5) - Other names: N-Butylacetamide; N-n-Butylacetamide

Condensed phase thermochemistry data

Data compiled by: Eugene S. Domalski and Elizabeth D. Hearing
Constant pressure heat capacity of liquid
Cp,liquid (J/mol*K) | Temperature (K) | Reference |
---|---|---|
236.89 | 298.15 | Zegers, Roegschoten, et al., 1986 |
236. | 298.15 | Konicek and Wadso, 1971 |

Phase change data

Data compiled as indicated in comments:
BS - Robert L. Brown and Stephen E. Stein
AC - William E. Acree, Jr., James S. Chickos
ALS - Hussein Y. Afeefy, Joel F. Liebman, and Stephen E. Stein
Quantity | Value | Units | Method | Reference | Comment |
---|---|---|---|---|---|
Tboil | 502.2 | K | N/A | Weast and Grasselli, 1989 | BS |
Quantity | Value | Units | Method | Reference | Comment |
ΔvapH° | 75.0 ± 0.3 | kJ/mol | C | Starzewski, Wadso, et al., 1984 | AC |
ΔvapH° | 76. ± 1. | kJ/mol | C | Wadso, 1965 | Heat of hydrolysis; ALS |

Reaction thermochemistry data

Data compiled by: Hussein Y. Afeefy, Joel F. Liebman, and Stephen E. Stein
Individual Reactions
By formula: C4H6O3 + C4H11N = C6H13NO + C2H4O2
Quantity | Value | Units | Method | Reference | Comment |
---|---|---|---|---|---|
ΔrH° | -113.2 ± 0.46 | kJ/mol | Cm | Wadso, 1962 | liquid phase |
ΔrH° | -163.7 ± 0.3 | kJ/mol | Cm | Wadso, 1958 | liquid phase; Heat of aminolysis |
By formula: C6H13NO + C2H4O2 = C8H15NO2 + H2O
Quantity | Value | Units | Method | Reference | Comment |
---|---|---|---|---|---|
ΔrH° | 40.5 ± 0.50 | kJ/mol | Cm | Wadso, 1965 | liquid phase; Heat of hydrolysis |
By formula: C4H11N + C6H12OS = C4H10S + C6H13NO
Quantity | Value | Units | Method | Reference | Comment |
---|---|---|---|---|---|
ΔrH° | -57.74 ± 0.63 | kJ/mol | Cm | Wadso, 1958 | liquid phase; Heat of aminolysis |
By formula: C4H11N + C4H5N3O = C6H13NO + C2H3N3
Quantity | Value | Units | Method | Reference | Comment |
---|---|---|---|---|---|
ΔrH° | -85.8 ± 0.3 | kJ/mol | Cm | Wadso, 1962 | solid phase |
By formula: C4H11N + C5H6N2O = C6H13NO + C3H4N2
Quantity | Value | Units | Method | Reference | Comment |
---|---|---|---|---|---|
ΔrH° | -75.6 ± 0.3 | kJ/mol | Cm | Wadso, 1962 | solid phase |
By formula: C6H13NO + H2O = C4H11N + C2H4O2
Quantity | Value | Units | Method | Reference | Comment |
---|---|---|---|---|---|
ΔrH° | 55.2 ± 0.2 | kJ/mol | Cm | Wadso, 1962 | liquid phase |

Kovats' RI, non-polar column, isothermal

Column type | Active phase | Temperature (C) | I | Reference | Comment |
---|---|---|---|---|---|
Packed | SE-30 | 180. | 1090. | Krawczyk and Piotrowski, 1989 | N2, Chromosorb W AW; Column length: 1. m |
Packed | Apiezon L | 150. | 1057. | Zhuravleva I.L., Golovnya R.V., et al., 1978 | N2, Chromosorb G-AW; Column length: 2.7 m |

Kovats' RI, polar column, isothermal

Column type | Active phase | Temperature (C) | I | Reference | Comment |
---|---|---|---|---|---|
Packed | Polyethylene Glycol | 150. | 1885. | Zhuravleva I.L., Golovnya R.V., et al., 1978 | N2, Chromosorb G-AW; Column length: 2.7 m |

Normal alkane RI, non-polar column, custom temperature program

Column type | Active phase | I | Reference | Comment |
---|---|---|---|---|
Capillary | Polydimethyl siloxanes | 1057. | Zenkevich and Chupalov, 1996 | Program: not specified |

References

Zegers, Roegschoten, et al., 1986
Zegers, H.C.; Roegschoten, R.; Mels, W.; Somsen, G.,
Flow calorimetry of viscous liquids. Volumes and heat capacities of mixtures of N,N-dimethylformamide with N-alkylacetamides,
Can. J. Chem., 1986, 64, 40-45. [all data]
Konicek and Wadso, 1971
Konicek, J.; Wadso, I.,
Thermochemical properties of some carboxylic acids, amines and N-substituted amides in aqueous solution,
Acta Chem. Scand., 1971, 25, 1541-1551. [all data]
Weast and Grasselli, 1989
CRC Handbook of Data on Organic Compounds, 2nd Editon, Weast,R.C and Grasselli, J.G., ed(s)., CRC Press, Inc., Boca Raton, FL, 1989, 1. [all data]
Starzewski, Wadso, et al., 1984
Starzewski, P.; Wadso, I.; Zielenkiewicz, W.,
Enthalpies of vaporization of some N-alkylamides at 298.15 K,
J. Chem. Thermodyn., 1984, 16, 331-334. [all data]
Wadso, 1965
Wadso, I.,
Thermochemical properties of diacetimide, N-butyldiacetimide and N-phenyldiacetimide,
Acta Chem. Scand., 1965, 19, 1079-1087. [all data]
Wadso, 1962
Wadso, I.,
Heats of aminolysis and hydrolysis of some N-acetyl compounds and of acetic anhydride,
Acta Chem. Scand., 1962, 16, 471-478. [all data]
Wadso, 1958
Wadso, I.,
The heats of aminolysis of n-butyl thiolacetate and acetic anhydride,
Acta Chem. Scand., 1958, 12, 635-640. [all data]
Nielsen and Schellman, 1967
Nielsen, E.B.; Schellman, J.A.,
The absorption spectra of simple amides and peptides,
J. Phys. Chem., 1967, 71, 7, 2297-2304. [all data]
Krawczyk and Piotrowski, 1989
Krawczyk, W.; Piotrowski, G.T.,
Relationships Between Structure and Retention Index for N-Substituted Amides of Aliphatic Acids on a Non-Polar Column,
J. Chromatogr., 1989, 463, 297-304, https://doi.org/10.1016/S0021-9673(01)84484-8
. [all data]
Zhuravleva I.L., Golovnya R.V., et al., 1978
Zhuravleva I.L.; Golovnya R.V.; Palamarchuk L.F.; Kishkovskii Z.N.,
Gas-chromatographic determination of N-monoalkylacetamides,
J. Anal. Chem. USSR (Engl. Transl.), 1978, 33, 11, 1717-1719. [all data]
Zenkevich and Chupalov, 1996
Zenkevich, I.G.; Chupalov, A.A.,
New Possibilities of Chromato Mass Pectrometric Identification of Organic Compounds Using Increments of Gas Chromatographic Retention Indices of Molecular Structural Fragments,
Zh. Org. Khim. (Rus.), 1996, 32, 5, 656-666. [all data]