Propanenitrile, 3,3'-iminobis-
- Formula: C6H9N3
- Molecular weight: 123.1558
- IUPAC Standard InChIKey: SBAJRGRUGUQKAF-UHFFFAOYSA-N
- CAS Registry Number: 111-94-4
- Chemical structure:
View 3d structure (requires JavaScript / HTML 5) - Other names: Bis(2-cyanoethyl)amine; Propionitrile, 3,3'-iminodi-; β,β'-Iminodipropionitrile; Bis(β-cyanoethyl)amine; BBCE; Di(2-Cyanoethyl)amine; Ethanamine, 2-cyano-N-(2-cyanoethyl)-; IDPN; N,N-Bis(2-Cyanoethyl)amine; 3,3'-Iminobis(propionitrile); 3,3'-Iminobis[propanenitrile]; 3,3'-Iminodipropionitrile; HN(CH2CH2CN)2; Iminodipropionitrile; Diethylamine, 2,2'-dicyano-; Imino-β,β'-dipropionitrile; Iminodipropanenitrile; USAF A-8564; 3,3'-Iminodipropanenitrile; Bis-(2-kyanethyl)amin; Di(2-cianoetil)ammina; 2341 I.S.; NSC 7770; 3,3'-iminodipropiononitrile

Phase change data

Data compiled as indicated in comments:
BS - Robert L. Brown and Stephen E. Stein
TRC - Thermodynamics Research Center, NIST Boulder Laboratories, Chris Muzny director
Quantity | Value | Units | Method | Reference | Comment |
---|---|---|---|---|---|
Tfus | 267.45 | K | N/A | Witschonke, 1954 | Uncertainty assigned by TRC = 0.3 K; TRC |
Tfus | 266.49 | K | N/A | Witschonke, 1954 | Uncertainty assigned by TRC = 0.2 K; TRC |
Reduced pressure boiling point
Tboil (K) | Pressure (bar) | Reference | Comment |
---|---|---|---|
478.2 | 0.033 | Aldrich Chemical Company Inc., 1990 | BS |
407. to 409. | 0.001 | Frinton Laboratories Inc., 1986 | BS |
407. to 408. | 0.001 | Buckingham and Donaghy, 1982 | BS |

References

Witschonke, 1954
Witschonke, C.R.,
Freezing point and purity data for some organic compounds,
Anal. Chem., 1954, 26, 562-4. [all data]
Aldrich Chemical Company Inc., 1990
Aldrich Chemical Company Inc.,
Catalog Handbook of Fine Chemicals, Aldrich Chemical Company, Inc., Milwaukee WI, 1990, 1. [all data]
Frinton Laboratories Inc., 1986
Frinton Laboratories Inc.,
Catalog Number 11, Frinton Laboratories Inc., Vineland, NJ, 1986, 99. [all data]
Buckingham and Donaghy, 1982
Buckingham, J.; Donaghy, S.M.,
Dictionary of Organic Compounds: Fifth Edition, Chapman and Hall, New York, 1982, 1. [all data]