2,4-Hexadienedioic acid, dimethyl ester, (E,E)-
- Formula: C8H10O4
- Molecular weight: 170.1626
- IUPAC Standard InChIKey: PXYBXMZVYNWQAM-GGWOSOGESA-N
- CAS Registry Number: 1119-43-3
- Chemical structure:
View 3d structure (requires JavaScript / HTML 5) - Other names: trans,trans-Dimethyl muconate; Dimethyl trans,trans-muconate; Dimethyl (E,E)-muconate

Phase change data

Data compiled by: Thermodynamics Research Center, NIST Boulder Laboratories, Chris Muzny director
Quantity | Value | Units | Method | Reference | Comment |
---|---|---|---|---|---|
Tfus | 428.15 | K | N/A | Smith and Carlson, 1939 | Uncertainty assigned by TRC = 5. K |

References

Smith and Carlson, 1939
Smith, L.I.; Carlson, E.J.,
Prehnitic Acid (Benzene-1,2,3,4-tetracroxylic Acid),
J. Am. Chem. Soc., 1939, 61, 288. [all data]