3-Penten-2-one, 4-amino-
- Formula: C5H9NO
- Molecular weight: 99.1311
- IUPAC Standard InChIKey: OSLAYKKXCYSJSF-ONEGZZNKSA-N
- CAS Registry Number: 1118-66-7
- Chemical structure:
View 3d structure (requires JavaScript / HTML 5) - Other names: Acetylacetonamine; 4-Amino-3-penten-2-one

Phase change data

Data compiled by: Robert L. Brown and Stephen E. Stein
Quantity | Value | Units | Method | Reference | Comment |
---|---|---|---|---|---|
Tboil | 482. to 483. | K | N/A | Frinton Laboratories Inc., 1986 |

References

Frinton Laboratories Inc., 1986
Frinton Laboratories Inc.,
Catalog Number 11, Frinton Laboratories Inc., Vineland, NJ, 1986, 99. [all data]
Cromwell and Watson, 1949
Cromwell, N.H.; Watson, W.R.,
J. Org. Chem., 1949, 14, 411. [all data]