Octane, 1-chloro-
- Formula: C8H17Cl
- Molecular weight: 148.674
- IUPAC Standard InChIKey: CNDHHGUSRIZDSL-UHFFFAOYSA-N
- CAS Registry Number: 111-85-3
- Chemical structure:
View 3d structure (requires JavaScript / HTML 5) - Other names: n-Octyl chloride; Capryl chloride; Octyl chloride; 1-Chlorooctane; 1-Octyl chloride

Gas phase thermochemistry data

Data compiled by: Hussein Y. Afeefy, Joel F. Liebman, and Stephen E. Stein
Quantity | Value | Units | Method | Reference | Comment |
---|---|---|---|---|---|
ΔfH°gas | -57.09 ± 0.45 | kcal/mol | Ccr | Stridth and Sunner, 1975 |

Condensed phase thermochemistry data

Data compiled as indicated in comments:
ALS - Hussein Y. Afeefy, Joel F. Liebman, and Stephen E. Stein
DH - Eugene S. Domalski and Elizabeth D. Hearing
Quantity | Value | Units | Method | Reference | Comment |
---|---|---|---|---|---|
ΔfH°liquid | -69.62 ± 0.45 | kcal/mol | Ccr | Stridth and Sunner, 1975 | ALS |
Quantity | Value | Units | Method | Reference | Comment |
ΔcH°liquid | -1269.13 ± 0.44 | kcal/mol | Ccr | Stridth and Sunner, 1975 | ALS |
Constant pressure heat capacity of liquid
Cp,liquid (cal/mol*K) | Temperature (K) | Reference | Comment |
---|---|---|---|
65.65 | 298.15 | Shehatta, 1993 | DH |

Phase change data

Data compiled as indicated in comments:
BS - Robert L. Brown and Stephen E. Stein
TRC - Thermodynamics Research Center, NIST Boulder Laboratories, Chris Muzny director
AC - William E. Acree, Jr., James S. Chickos
ALS - Hussein Y. Afeefy, Joel F. Liebman, and Stephen E. Stein
Quantity | Value | Units | Method | Reference | Comment |
---|---|---|---|---|---|
Tboil | 455.2 | K | N/A | Weast and Grasselli, 1989 | BS |
Tboil | 456.95 | K | N/A | Szwarc, 1950 | Uncertainty assigned by TRC = 0.3 K; TRC |
Tboil | 451.0 | K | N/A | Von Reis, 1881 | Uncertainty assigned by TRC = 1.5 K; TRC |
Quantity | Value | Units | Method | Reference | Comment |
ΔvapH° | 12.53 | kcal/mol | N/A | Majer and Svoboda, 1985 | |
ΔvapH° | 12.3 | kcal/mol | N/A | Boublik, Fried, et al., 1984 | Based on data from 330. to 460. K. See also Basarová and Svoboda, 1991.; AC |
ΔvapH° | 12.5 ± 0.02 | kcal/mol | C | Wadsö, Luoma, et al., 1968 | AC |
ΔvapH° | 12.53 ± 0.029 | kcal/mol | C | Wadso, 1968 | ALS |
Reduced pressure boiling point
Tboil (K) | Pressure (atm) | Reference | Comment |
---|---|---|---|
351.2 | 0.020 | Weast and Grasselli, 1989 | BS |
Enthalpy of vaporization
ΔvapH (kcal/mol) | Temperature (K) | Method | Reference | Comment |
---|---|---|---|---|
12.0 | 342. | A,DTA | Stephenson and Malanowski, 1987 | Based on data from 327. to 457. K. See also Kemme and Kreps, 1969.; AC |
Antoine Equation Parameters
log10(P) = A − (B / (T + C))
P = vapor pressure (atm)
T = temperature (K)
View plot Requires a JavaScript / HTML 5 canvas capable browser.
Temperature (K) | A | B | C | Reference |
---|---|---|---|---|
327.3 to 457.3 | 3.9623 | 1469.829 | -85.993 | Kemme and Kreps, 1969 |

Van Den Dool and Kratz RI, non-polar column, temperature ramp

Data compiled by: NIST Mass Spectrometry Data Center, William E. Wallace, director

Column type CapillaryCapillaryCapillary
Active phase SPB-5DB-1Petrocol DH
Column length (m) 60.30.100.
Carrier gas  HeHe
Substrate
Column diameter (mm) 0.320.250.25
Phase thickness (μm) 1.0.250.5
Tstart (C) 40.40.30.
Tend (C) 230.325.220.
Heat rate (K/min) 3.3.1.
Initial hold (min) 2.
Final hold (min) 10.
I 1064.1043.81047.
ReferenceEngel and Ratel, 2007Sun and Stremple, 2003White, Hackett, et al., 1992
Comment MSDC-RI MSDC-RI MSDC-RI

Kovats' RI, non-polar column, isothermal

Data compiled by: NIST Mass Spectrometry Data Center, William E. Wallace, director

Column type PackedCapillary
Active phase ApolaneApiezon L
Column length (m) 3.745.
Carrier gas  He
Substrate
Column diameter (mm)  0.25
Phase thickness (μm)
Temperature (C) 130.90.
I 1046.1059.
ReferenceDutoit, 1991Morishita, Terashima, et al., 1983
Comment MSDC-RI MSDC-RI

Normal alkane RI, polar column, custom temperature program

Data compiled by: NIST Mass Spectrometry Data Center, William E. Wallace, director

Column type Capillary
Active phase DB-Wax
Column length (m)
Carrier gas
Substrate
Column diameter (mm)
Phase thickness (μm)
Program not specified
I 1262.
ReferencePeng, Yang, et al., 1991
Comment MSDC-RI

References

Stridth and Sunner, 1975
Stridth, G.; Sunner, S.,
Enthalpies of formation of some 1-chloroalkanes and the CH2-increment in the 1-chloroalkanes series,
J. Chem. Thermodyn., 1975, 7, 161-168. [all data]
Shehatta, 1993
Shehatta, I.,
Heat capacity at constant pressure of some halogen compounds,
Thermochim. Acta, 1993, 213, 1-10. [all data]
Weast and Grasselli, 1989
CRC Handbook of Data on Organic Compounds, 2nd Editon, Weast,R.C and Grasselli, J.G., ed(s)., CRC Press, Inc., Boca Raton, FL, 1989, 1. [all data]
Szwarc, 1950
Szwarc, M.,
Chem. Rev., 1950, 47, 75. [all data]
Von Reis, 1881
Von Reis, M.A.,
IV. The Specific Heat of Liquid Organic Compounds and its Relation to Molecular Weight.,
Ann. Phys. (Leipzig), 1881, 13, 447. [all data]
Majer and Svoboda, 1985
Majer, V.; Svoboda, V.,
Enthalpies of Vaporization of Organic Compounds: A Critical Review and Data Compilation, Blackwell Scientific Publications, Oxford, 1985, 300. [all data]
Boublik, Fried, et al., 1984
Boublik, T.; Fried, V.; Hala, E.,
The Vapour Pressures of Pure Substances: Selected Values of the Temperature Dependence of the Vapour Pressures of Some Pure Substances in the Normal and Low Pressure Region, 2nd ed., Elsevier, New York, 1984, 972. [all data]
Basarová and Svoboda, 1991
Basarová, Pavlína; Svoboda, Václav,
Calculation of heats of vaporization of halogenated hydrocarbons from saturated vapour pressure data,
Fluid Phase Equilibria, 1991, 68, 13-34, https://doi.org/10.1016/0378-3812(91)85008-I
. [all data]
Wadsö, Luoma, et al., 1968
Wadsö, Ingemar; Luoma, Sinikka; Olson, Thomas; Norin, Torbjörn,
Heats of Vaporization of Organic Compounds. II. Chlorides, Bromides, and Iodides.,
Acta Chem. Scand., 1968, 22, 2438-2444, https://doi.org/10.3891/acta.chem.scand.22-2438
. [all data]
Wadso, 1968
Wadso, I.,
Heats of vaporization of organic compounds II. Chlorides, bromides, and iodides,
Acta Chem. Scand., 1968, 22, 2438. [all data]
Stephenson and Malanowski, 1987
Stephenson, Richard M.; Malanowski, Stanislaw,
Handbook of the Thermodynamics of Organic Compounds, 1987, https://doi.org/10.1007/978-94-009-3173-2
. [all data]
Kemme and Kreps, 1969
Kemme, Herbert R.; Kreps, Saul I.,
Vapor pressure of primary n-alkyl chlorides and alcohols,
J. Chem. Eng. Data, 1969, 14, 1, 98-102, https://doi.org/10.1021/je60040a011
. [all data]