Urea, (1,1-dimethylethyl)-
- Formula: C5H12N2O
- Molecular weight: 116.1616
- IUPAC Standard InChIKey: JLEHSYHLHLHPAL-UHFFFAOYSA-N
- CAS Registry Number: 1118-12-3
- Chemical structure:
View 3d structure (requires JavaScript / HTML 5) - Other names: tert-Butylurea; N-tert-Butylurea; Urea, tert-butyl-

Gas phase thermochemistry data

Data compiled by: Hussein Y. Afeefy, Joel F. Liebman, and Stephen E. Stein
Quantity | Value | Units | Method | Reference | Comment |
---|---|---|---|---|---|
ΔfH°gas | -75.05 ± 0.35 | kcal/mol | Ccb | Kabo, Miroshnichenko, et al., 1990 | see Simirsky, Kabo, et al., 1987 and Simirskii, Kabo, et al., 1986 |

Condensed phase thermochemistry data

Data compiled by: Hussein Y. Afeefy, Joel F. Liebman, and Stephen E. Stein
Quantity | Value | Units | Method | Reference | Comment |
---|---|---|---|---|---|
ΔfH°solid | -99.12 ± 0.21 | kcal/mol | Ccb | Kabo, Miroshnichenko, et al., 1990 | see Simirsky, Kabo, et al., 1987 and Simirskii, Kabo, et al., 1986 |
Quantity | Value | Units | Method | Reference | Comment |
ΔcH°solid | -781.02 ± 0.13 | kcal/mol | Ccb | Kabo, Miroshnichenko, et al., 1990 | see Simirsky, Kabo, et al., 1987 and Simirskii, Kabo, et al., 1986 |

Phase change data

Data compiled as indicated in comments:
TRC - Thermodynamics Research Center, NIST Boulder Laboratories, Chris Muzny director
AC - William E. Acree, Jr., James S. Chickos
ALS - Hussein Y. Afeefy, Joel F. Liebman, and Stephen E. Stein
DH - Eugene S. Domalski and Elizabeth D. Hearing
Quantity | Value | Units | Method | Reference | Comment |
---|---|---|---|---|---|
Tfus | 449.8 | K | N/A | DellaGatta and Ferro, 1987 | Uncertainty assigned by TRC = 0.7 K; TRC |
Quantity | Value | Units | Method | Reference | Comment |
ΔsubH° | 23.5 ± 0.1 | kcal/mol | GS | Emel'yanenko, Kabo, et al., 2006 | Based on data from 335. to 397. K.; AC |
Enthalpy of sublimation
ΔsubH (kcal/mol) | Temperature (K) | Method | Reference | Comment |
---|---|---|---|---|
23.3 ± 0.2 | 353. | ME | Zaitsau, Kabo, et al., 2003 | Based on data from 333. to 372. K.; AC |
23.4 ± 0.2 | 350. | ME | Zaitsau, Kabo, et al., 2003 | Based on data from 333. to 372. K.; AC |
22.6 ± 0.2 | 350. | C | Zaitsau, Kabo, et al., 2003 | AC |
24.07 ± 0.29 | 354. | C | Kabo, Miroshnichenko, et al., 1990 | see Simirsky, Kabo, et al., 1987 and Simirskii, Kabo, et al., 1986; ALS |
24.3 ± 0.2 | 379. | TE | Piacente, Ferro, et al., 1990 | AC |
Enthalpy of fusion
ΔfusH (kcal/mol) | Temperature (K) | Reference | Comment |
---|---|---|---|
7.9183 | 449.8 | Della Gatta and Ferro, 1987 | DH |
7.918 | 449.8 | Acree, 1991 | AC |
Entropy of fusion
ΔfusS (cal/mol*K) | Temperature (K) | Reference | Comment |
---|---|---|---|
17.6 | 449.8 | Della Gatta and Ferro, 1987 | DH |

References

Kabo, Miroshnichenko, et al., 1990
Kabo, G.Ya.; Miroshnichenko, E.A.; Frenkel, M.L.; Kozyro, A.A.; Simirskii, V.V.; Krasulin, A.P.; Vorob'eva, V.P.; Lebedev, Yu.A.,
Thermochemistry of urea alkyl derivatives,
Bull. Acad. Sci. USSR, Div. Chem. Sci., 1990, 662-667. [all data]
Simirsky, Kabo, et al., 1987
Simirsky, V.V.; Kabo, G.J.; Frenkel, M.L.,
Additivity of the enthalpies of formation of urea derivatives in the crystalline state,
J. Chem. Thermodyn., 1987, 19, 1121-1127. [all data]
Simirskii, Kabo, et al., 1986
Simirskii, V.V.; Kabo, G.Ya.; Frenkel, M.L.,
Enthalpies of combustion and of formation of monoalkyl derivatives of urea,
Russ. J. Phys. Chem. (Engl. Transl.), 1986, 60, 1233-1234. [all data]
DellaGatta and Ferro, 1987
DellaGatta, G.; Ferro, D.,
Enthalpies of fusion and solid-to-solid transition, entropies of fusion for urea and twelve alkylurea,
Thermochim. Acta, 1987, 122, 143-52. [all data]
Emel'yanenko, Kabo, et al., 2006
Emel'yanenko, Vladimir N.; Kabo, Gennady J.; Verevkin, Sergey P.,
Measurement and Prediction of Thermochemical Properties: Improved Increments for the Estimation of Enthalpies of Sublimation and Standard Enthalpies of Formation of Alkyl Derivatives of Urea,
J. Chem. Eng. Data, 2006, 51, 1, 79-87, https://doi.org/10.1021/je050230z
. [all data]
Zaitsau, Kabo, et al., 2003
Zaitsau, Dz; Kabo, G.J.; Kozyro, A.A.; Sevruk, V.M.,
The effect of the failure of isotropy of a gas in an effusion cell on the vapor pressure and enthalpy of sublimation for alkyl derivatives of carbamide,
Thermochimica Acta, 2003, 406, 1-2, 17-28, https://doi.org/10.1016/S0040-6031(03)00231-4
. [all data]
Piacente, Ferro, et al., 1990
Piacente, V.; Ferro, D.; Gatta, G. Della,
Sublimation enthalpy of eleven alkyl derivatives of urea,
Thermochimica Acta, 1990, 158, 1, 79-85, https://doi.org/10.1016/0040-6031(90)80054-3
. [all data]
Della Gatta and Ferro, 1987
Della Gatta, G.; Ferro, D.,
Enthalpies of fusion and solid-to-solid transition, entropies of fusion for urea and twelve alkylureas,
Thermochim. Acta, 1987, 122, 143-152. [all data]
Acree, 1991
Acree, William E.,
Thermodynamic properties of organic compounds: enthalpy of fusion and melting point temperature compilation,
Thermochimica Acta, 1991, 189, 1, 37-56, https://doi.org/10.1016/0040-6031(91)87098-H
. [all data]