1,2-Octanediol
- Formula: C8H18O2
- Molecular weight: 146.2273
- IUPAC Standard InChIKey: AEIJTFQOBWATKX-UHFFFAOYSA-N
- CAS Registry Number: 1117-86-8
- Chemical structure:
View 3d structure (requires JavaScript / HTML 5) - Other names: 1,2-Dihydroxyoctane; 1,2-Octylene glycol; octane-1,2-diol

Phase change data

Data compiled as indicated in comments:
BS - Robert L. Brown and Stephen E. Stein
TRC - Thermodynamics Research Center, NIST Boulder Laboratories, Chris Muzny director
Quantity | Value | Units | Method | Reference | Comment |
---|---|---|---|---|---|
Tfus | 302.65 | K | N/A | Emmons, Pagano, et al., 1954 | Uncertainty assigned by TRC = 1.5 K; TRC |
Tfus | 303.4 | K | N/A | Swern, Billen, et al., 1946 | Uncertainty assigned by TRC = 0.3 K; TRC |
Reduced pressure boiling point
Tboil (K) | Pressure (bar) | Reference | Comment |
---|---|---|---|
404.7 | 0.013 | Aldrich Chemical Company Inc., 1990 | BS |

Kovats' RI, non-polar column, isothermal

Column type | Active phase | Temperature (C) | I | Reference | Comment |
---|---|---|---|---|---|
Packed | Apiezon L | 160. | 1204. | Bogoslovsky, Anvaer, et al., 1978 | Celite 545 |

Van Den Dool and Kratz RI, non-polar column, custom temperature program

Column type | Active phase | I | Reference | Comment |
---|---|---|---|---|
Capillary | DB-1 | 1214. | Peng, 2000 | 15. m/0.53 mm/1. μm, He; Program: 40C(3min) => 8C/min => 200(1min) => 5C/min => 300C(25min) |

References

Emmons, Pagano, et al., 1954
Emmons, W.D.; Pagano, A.S.; Freeman, J.P.,
J. Am. Chem. Soc., 1954, 76, 3472. [all data]
Swern, Billen, et al., 1946
Swern, D.; Billen, N.; Scanlan, J.T.,
Hydroxylation and Epoxidation of SOme 1-Olefins with Per-acids,
J. Am. Chem. Soc., 1946, 68, 1504. [all data]
Aldrich Chemical Company Inc., 1990
Aldrich Chemical Company Inc.,
Catalog Handbook of Fine Chemicals, Aldrich Chemical Company, Inc., Milwaukee WI, 1990, 1. [all data]
Bogoslovsky, Anvaer, et al., 1978
Bogoslovsky, Yu.N.; Anvaer, B.I.; Vigdergauz, M.S.,
Chromatographic constants in gas chromatography (in Russian), Standards Publ. House, Moscow, 1978, 192. [all data]
Peng, 2000
Peng, C.T.,
Prediction of retention indices. V. Influence of electronic effects and column polarity on retention index,
J. Chromatogr. A, 2000, 903, 1-2, 117-143, https://doi.org/10.1016/S0021-9673(00)00901-8
. [all data]