Propanedioic acid, dipropyl ester
- Formula: C9H16O4
- Molecular weight: 188.2209
- IUPAC Standard InChIKey: LWIWFCDNJNZEKB-UHFFFAOYSA-N
- CAS Registry Number: 1117-19-7
- Chemical structure:
View 3d structure (requires JavaScript / HTML 5) - Other names: Di-n-propyl malonate; Dipropyl malonate

Phase change data

Data compiled by: Thermodynamics Research Center, NIST Boulder Laboratories, Chris Muzny director
Quantity | Value | Units | Method | Reference | Comment |
---|---|---|---|---|---|
Tboil | 502.4 | K | N/A | Timmermans, 1927 | Uncertainty assigned by TRC = 0.7 K; source of data not clear |
Quantity | Value | Units | Method | Reference | Comment |
Tfus | 196.1 | K | N/A | Palomaa and Mikkila, 1942 | Uncertainty assigned by TRC = 1. K |

Normal alkane RI, non-polar column, isothermal

View large format table.

Column type Active phase Temperature (C) I Reference Comment
CapillaryOV-101130.1220.Lipp, Krasnykh, et al., 2008Helium; Column length: 50. m; Column diameter: 0.25 mm
CapillaryOV-101140.1221.Lipp, Krasnykh, et al., 2008Helium; Column length: 50. m; Column diameter: 0.25 mm
CapillaryOV-101150.1218.Lipp, Krasnykh, et al., 2008Helium; Column length: 50. m; Column diameter: 0.25 mm
CapillaryOV-101160.1220.Lipp, Krasnykh, et al., 2008Helium; Column length: 50. m; Column diameter: 0.25 mm

Normal alkane RI, non-polar column, temperature ramp

View large format table.

Column type Active phase I Reference Comment
CapillaryUltra-11220.Okumura, 199125. m/0.32 mm/0.25 μm, He, 3. K/min; Tstart: 80. C; Tend: 260. C

Normal alkane RI, non-polar column, custom temperature program

View large format table.

Column type Active phase I Reference Comment
CapillarySE-301227.Vinogradov, 2004Program: not specified

Normal alkane RI, polar column, custom temperature program

View large format table.

Column type Active phase I Reference Comment
CapillaryCarbowax 20M1700.Vinogradov, 2004Program: not specified

References

Timmermans, 1927
Timmermans, J.,
The Melting Point of Organic Substances,
Bull. Soc. Chim. Belg., 1927, 36, 502. [all data]
Palomaa and Mikkila, 1942
Palomaa, M.H.; Mikkila, I.,
Etherlike Compounds XXVII Turbid Phases in Compounds with Reactivity Minimums,
Chem. Ber., 1942, 75B, 1659-67. [all data]